Maven/Jalopy

HomePage | Maven | RecentChanges | Preferences

Problem

Version 1.3.1 of the Maven Jalopy Plugin wasn't working for me (see below) yet it still works for Ted. No idea how...

In an attempt to keep using Jalopy 1.0b11, below is a patch for 1.4.1-SNAPSHOT. Unfortunatly, I still get the NoClassDefFound? error. :(

Index: project.xml
===================================================================
--- project.xml	(revision 376926)
+++ project.xml	(working copy)
@@ -22,7 +22,7 @@
   <pomVersion>3</pomVersion>
   <id>maven-jalopy-plugin</id>
   <name>Maven Jalopy Plugin</name>
-  <currentVersion>1.4.1-SNAPSHOT</currentVersion>
+  <currentVersion>1.3.2-STRUTS</currentVersion>
   <description/>
   <shortDescription>Reformat java source</shortDescription>
   <url>http://maven.apache.org/maven-1.x/reference/plugins/jalopy/</url>
@@ -94,7 +94,8 @@
     <dependency>
       <groupId>jalopy</groupId>
       <artifactId>jalopy</artifactId>
-      <version>1.5b5</version>
+      <!--version>1.5b5</version-->
+      <version>1.0b11</version>
       <properties>
         <classloader>root</classloader>
       </properties>
@@ -102,7 +103,8 @@
     <dependency>
       <groupId>jalopy</groupId>
       <artifactId>jalopy-ant</artifactId>
-      <version>0.1-1.5b5</version>
+      <!--version>0.1-1.5b5</version-->
+      <version>0.6.2</version>
       <properties>
         <classloader>root</classloader>
       </properties>
@@ -111,35 +113,57 @@
       <groupId>aelfred</groupId>
       <artifactId>aelfred</artifactId>
       <version>1.2</version>
+      <properties>
+        <classloader>root</classloader>
+      </properties>
     </dependency>
     <dependency>
-      <groupId>xerces</groupId>
+      <!--groupId>xerces</groupId>
       <artifactId>xmlParserAPIs</artifactId>
-      <version>2.6.2</version>
+      <version>2.6.2</version-->
+      <groupId>xml-apis</groupId>
+      <artifactId>xml-apis</artifactId>
+      <version>1.0.b2</version>
       <url>http://xerces.apache.org/xerces2-j/</url>
+      <properties>
+        <classloader>root</classloader>
+      </properties>
     </dependency>
     <dependency>
       <groupId>jdom</groupId>
       <artifactId>jdom</artifactId>
-      <version>1.0</version>
+      <version>1.0b8</version>
+      <!--version>1.0</version-->
+      <properties>
+        <classloader>root</classloader>
+    </properties>
     </dependency>
     <dependency>
       <groupId>log4j</groupId>
       <artifactId>log4j</artifactId>
-      <version>1.2.12</version>
+      <!--version>1.2.12</version-->
+      <version>1.2.8</version>
       <properties>
+        <classloader>root</classloader>
         <comment>This library is already loaded by maven's core. Be careful to use the same version number as in the core.</comment>
       </properties>
     </dependency>
     <dependency>
       <groupId>oro</groupId>
       <artifactId>oro</artifactId>
-      <version>2.0.8</version>
+      <version>2.0.7</version>
+      <!--version>2.0.8</version-->
+      <properties>
+        <classloader>root</classloader>
+      </properties>
     </dependency>
     <dependency>
       <groupId>textarea</groupId>
       <artifactId>textarea</artifactId>
       <version>2.2.3</version>
+      <properties>
+        <classloader>root</classloader>
+      </properties>
     </dependency>
   </dependencies>
 </project>

$ maven jalopy
 __  __
|  \/  |__ _Apache__ ___
| |\/| / _` \ V / -_) ' \  ~ intelligent projects ~
|_|  |_\__,_|\_/\___|_||_|  v. 1.0.2

java.lang.ClassCastException: java.lang.String
        at de.hunsicker.jalopy.storage.Convention.synchronize(Convention.java:24
19)
        at de.hunsicker.jalopy.storage.Convention.synchronize(Convention.java:24
45)
        at de.hunsicker.jalopy.storage.Convention.<clinit>(Convention.java:211)
        at de.hunsicker.jalopy.plugin.ant.AntPlugin.<clinit>(AntPlugin.java:60)
        at sun.reflect.NativeConstructorAccessorImpl.newInstance0(Native Method)

        at sun.reflect.NativeConstructorAccessorImpl.newInstance(NativeConstruct
orAccessorImpl.java:39)
        at sun.reflect.DelegatingConstructorAccessorImpl.newInstance(DelegatingC
onstructorAccessorImpl.java:27)
        at java.lang.reflect.Constructor.newInstance(Constructor.java:494)
        at org.apache.tools.ant.AntClassLoader.initializeClass(AntClassLoader.ja
va:490)
        at org.apache.tools.ant.taskdefs.Definer.addDefinition(Definer.java:231)

        at org.apache.tools.ant.taskdefs.Definer.execute(Definer.java:162)
        at org.apache.tools.ant.Task.perform(Task.java:341)
        at org.apache.commons.jelly.tags.ant.AntTag.doTag(AntTag.java:185)
        at org.apache.commons.jelly.impl.TagScript.run(TagScript.java:279)
        at org.apache.commons.jelly.impl.ScriptBlock.run(ScriptBlock.java:135)
        at org.apache.maven.jelly.tags.werkz.MavenGoalTag.runBodyTag(MavenGoalTa
g.java:79)
        at org.apache.maven.jelly.tags.werkz.MavenGoalTag$MavenGoalAction.perfor
mAction(MavenGoalTag.java:110)
        at com.werken.werkz.Goal.fire(Goal.java:639)
        at com.werken.werkz.Goal.attain(Goal.java:575)
        at com.werken.werkz.Goal.attainPrecursors(Goal.java:488)
        at com.werken.werkz.Goal.attain(Goal.java:573)
        at com.werken.werkz.Goal.attainPrecursors(Goal.java:488)
        at com.werken.werkz.Goal.attain(Goal.java:573)
        at org.apache.maven.plugin.PluginManager.attainGoals(PluginManager.java:
671)
        at org.apache.maven.MavenSession.attainGoals(MavenSession.java:263)
        at org.apache.maven.cli.App.doMain(App.java:488)
        at org.apache.maven.cli.App.main(App.java:1239)
        at sun.reflect.NativeMethodAccessorImpl.invoke0(Native Method)
        at sun.reflect.NativeMethodAccessorImpl.invoke(NativeMethodAccessorImpl.
java:39)
        at sun.reflect.DelegatingMethodAccessorImpl.invoke(DelegatingMethodAcces
sorImpl.java:25)
        at java.lang.reflect.Method.invoke(Method.java:585)
        at com.werken.forehead.Forehead.run(Forehead.java:551)
        at com.werken.forehead.Forehead.main(Forehead.java:581)
build:start:

jalopy:taskdef:

java:prepare-filesystem:

java:compile:
    [echo] Compiling to c:\projects\test-jalopy/target/classes
    [echo]
==========================================================

  NOTE: Targetting JVM 1.5, classes
  will not run on earlier JVMs

==========================================================

    [javac] Compiling 1 source file to C:\projects\test-jalopy\target\classes

BUILD FAILED
File...... c:\java\m1-repository\cache\maven-jalopy-plugin-1.3.2-STRUTS\plugin.j
elly
Element... ant:jalopy
Line...... 64
Column.... 46
java.lang.NoClassDefFoundError
Total time: 3 seconds
Finished at: Fri Feb 10 21:10:49 GMT-07:00 2006


Problem

Inexplicably, the Maven 1 Jalopy plugin has stopped working for me on two different machines. Below you can see the console output, and then the output that was redirected to a file.

It worked fine earlier tonight, and the only thing that changed was the Jalopy XML configuration file. On the first machine, *completely* re-installing Maven and starting over with the repository did not solve the problem. I haven't done much with it on machine #2 yet.

Console

/svn/struts/current/action
$ maven jalopy -X > maven-jalopy.log
java.lang.ClassCastException: java.lang.String
        at de.hunsicker.jalopy.storage.Convention.synchronize(Convention.java:2419)
        at de.hunsicker.jalopy.storage.Convention.synchronize(Convention.java:2445)
        at de.hunsicker.jalopy.storage.Convention.<clinit>(Convention.java:211)
        at de.hunsicker.jalopy.plugin.ant.AntPlugin.<clinit>(AntPlugin.java:60)
        at sun.reflect.NativeConstructorAccessorImpl.newInstance0(Native Method)

        at sun.reflect.NativeConstructorAccessorImpl.newInstance(NativeConstructorAccessorImpl.java:39)
        at sun.reflect.DelegatingConstructorAccessorImpl.newInstance(DelegatingConstructorAccessorImpl.java:27)
        at java.lang.reflect.Constructor.newInstance(Constructor.java:494)
        at org.apache.tools.ant.AntClassLoader.initializeClass(AntClassLoader.java:490)
        at org.apache.tools.ant.taskdefs.Definer.addDefinition(Definer.java:231)

        at org.apache.tools.ant.taskdefs.Definer.execute(Definer.java:162)
        at org.apache.tools.ant.Task.perform(Task.java:341)
        at org.apache.commons.jelly.tags.ant.AntTag.doTag(AntTag.java:185)
        at org.apache.commons.jelly.impl.TagScript.run(TagScript.java:279)
        at org.apache.commons.jelly.impl.ScriptBlock.run(ScriptBlock.java:135)
        at org.apache.maven.jelly.tags.werkz.MavenGoalTag.runBodyTag(MavenGoalTag.java:79)
        at org.apache.maven.jelly.tags.werkz.MavenGoalTag$MavenGoalAction.performAction(MavenGoalTag.java:110)
        at com.werken.werkz.Goal.fire(Goal.java:639)
        at com.werken.werkz.Goal.attain(Goal.java:575)
        at com.werken.werkz.Goal.attainPrecursors(Goal.java:488)
        at com.werken.werkz.Goal.attain(Goal.java:573)
        at com.werken.werkz.Goal.attainPrecursors(Goal.java:488)
        at com.werken.werkz.Goal.attain(Goal.java:573)
        at org.apache.maven.plugin.PluginManager.attainGoals(PluginManager.java:671)
        at org.apache.maven.MavenSession.attainGoals(MavenSession.java:263)
        at org.apache.maven.cli.App.doMain(App.java:488)
        at org.apache.maven.cli.App.main(App.java:1239)
        at sun.reflect.NativeMethodAccessorImpl.invoke0(Native Method)
        at sun.reflect.NativeMethodAccessorImpl.invoke(NativeMethodAccessorImpl.java:39)
        at sun.reflect.DelegatingMethodAccessorImpl.invoke(DelegatingMethodAccessorImpl.java:25)
        at java.lang.reflect.Method.invoke(Method.java:585)
        at com.werken.forehead.Forehead.run(Forehead.java:551)
        at com.werken.forehead.Forehead.main(Forehead.java:581)

BUILD FAILED
File...... c:\java\m1-repository\cache\maven-jalopy-plugin-1.3.1\plugin.jelly
Element... ant:jalopy
Line...... 64
Column.... 46
java.lang.NoClassDefFoundError
com.werken.werkz.UnattainableGoalException: Unable to obtain goal [jalopy:format
] -- c:\java\m1-repository\cache\maven-jalopy-plugin-1.3.1\plugin.jelly:64:46: <
ant:jalopy> java.lang.NoClassDefFoundError
        at com.werken.werkz.Goal.fire(Goal.java:646)
        at com.werken.werkz.Goal.attain(Goal.java:575)
        at com.werken.werkz.Goal.attainPrecursors(Goal.java:488)
        at com.werken.werkz.Goal.attain(Goal.java:573)
        at org.apache.maven.plugin.PluginManager.attainGoals(PluginManager.java:
671)
        at org.apache.maven.MavenSession.attainGoals(MavenSession.java:263)
        at org.apache.maven.cli.App.doMain(App.java:488)
        at org.apache.maven.cli.App.main(App.java:1239)
        at sun.reflect.NativeMethodAccessorImpl.invoke0(Native Method)
        at sun.reflect.NativeMethodAccessorImpl.invoke(NativeMethodAccessorImpl.
java:39)
        at sun.reflect.DelegatingMethodAccessorImpl.invoke(DelegatingMethodAcces
sorImpl.java:25)
        at java.lang.reflect.Method.invoke(Method.java:585)
        at com.werken.forehead.Forehead.run(Forehead.java:551)
        at com.werken.forehead.Forehead.main(Forehead.java:581)
org.apache.commons.jelly.JellyTagException: c:\java\m1-repository\cache\maven-ja
lopy-plugin-1.3.1\plugin.jelly:64:46: <ant:jalopy> java.lang.NoClassDefFoundErro
r
        at org.apache.commons.jelly.impl.TagScript.handleException(TagScript.jav
a:702)
        at org.apache.commons.jelly.impl.TagScript.run(TagScript.java:296)
        at org.apache.commons.jelly.impl.ScriptBlock.run(ScriptBlock.java:135)
        at org.apache.maven.jelly.tags.werkz.MavenGoalTag.runBodyTag(MavenGoalTa
g.java:79)
        at org.apache.maven.jelly.tags.werkz.MavenGoalTag$MavenGoalAction.perfor
mAction(MavenGoalTag.java:110)
        at com.werken.werkz.Goal.fire(Goal.java:639)
        at com.werken.werkz.Goal.attain(Goal.java:575)
        at com.werken.werkz.Goal.attainPrecursors(Goal.java:488)
        at com.werken.werkz.Goal.attain(Goal.java:573)
        at org.apache.maven.plugin.PluginManager.attainGoals(PluginManager.java:
671)
        at org.apache.maven.MavenSession.attainGoals(MavenSession.java:263)
        at org.apache.maven.cli.App.doMain(App.java:488)
        at org.apache.maven.cli.App.main(App.java:1239)
        at sun.reflect.NativeMethodAccessorImpl.invoke0(Native Method)
        at sun.reflect.NativeMethodAccessorImpl.invoke(NativeMethodAccessorImpl.
java:39)
        at sun.reflect.DelegatingMethodAccessorImpl.invoke(DelegatingMethodAcces
sorImpl.java:25)
        at java.lang.reflect.Method.invoke(Method.java:585)
        at com.werken.forehead.Forehead.run(Forehead.java:551)
        at com.werken.forehead.Forehead.main(Forehead.java:581)
Caused by: java.lang.NoClassDefFoundError
        at sun.reflect.NativeConstructorAccessorImpl.newInstance0(Native Method)

        at sun.reflect.NativeConstructorAccessorImpl.newInstance(NativeConstruct
orAccessorImpl.java:39)
        at sun.reflect.DelegatingConstructorAccessorImpl.newInstance(DelegatingC
onstructorAccessorImpl.java:27)
        at java.lang.reflect.Constructor.newInstance(Constructor.java:494)
        at java.lang.Class.newInstance0(Class.java:350)
        at java.lang.Class.newInstance(Class.java:303)
        at org.apache.commons.jelly.tags.ant.AntTag.createTask(AntTag.java:487)
        at org.apache.commons.jelly.tags.ant.AntTag.createTask(AntTag.java:474)
        at org.apache.commons.jelly.tags.ant.AntTag.doTag(AntTag.java:126)
        at org.apache.commons.jelly.impl.TagScript.run(TagScript.java:279)
        ... 17 more
Root cause
java.lang.NoClassDefFoundError
        at sun.reflect.NativeConstructorAccessorImpl.newInstance0(Native Method)

        at sun.reflect.NativeConstructorAccessorImpl.newInstance(NativeConstruct
orAccessorImpl.java:39)
        at sun.reflect.DelegatingConstructorAccessorImpl.newInstance(DelegatingC
onstructorAccessorImpl.java:27)
        at java.lang.reflect.Constructor.newInstance(Constructor.java:494)
        at java.lang.Class.newInstance0(Class.java:350)
        at java.lang.Class.newInstance(Class.java:303)
        at org.apache.commons.jelly.tags.ant.AntTag.createTask(AntTag.java:487)
        at org.apache.commons.jelly.tags.ant.AntTag.createTask(AntTag.java:474)
        at org.apache.commons.jelly.tags.ant.AntTag.doTag(AntTag.java:126)
        at org.apache.commons.jelly.impl.TagScript.run(TagScript.java:279)
        at org.apache.commons.jelly.impl.ScriptBlock.run(ScriptBlock.java:135)
        at org.apache.maven.jelly.tags.werkz.MavenGoalTag.runBodyTag(MavenGoalTa
g.java:79)
        at org.apache.maven.jelly.tags.werkz.MavenGoalTag$MavenGoalAction.perfor
mAction(MavenGoalTag.java:110)
        at com.werken.werkz.Goal.fire(Goal.java:639)
        at com.werken.werkz.Goal.attain(Goal.java:575)
        at com.werken.werkz.Goal.attainPrecursors(Goal.java:488)
        at com.werken.werkz.Goal.attain(Goal.java:573)
        at org.apache.maven.plugin.PluginManager.attainGoals(PluginManager.java:
671)
        at org.apache.maven.MavenSession.attainGoals(MavenSession.java:263)
        at org.apache.maven.cli.App.doMain(App.java:488)
        at org.apache.maven.cli.App.main(App.java:1239)
        at sun.reflect.NativeMethodAccessorImpl.invoke0(Native Method)
        at sun.reflect.NativeMethodAccessorImpl.invoke(NativeMethodAccessorImpl.
java:39)
        at sun.reflect.DelegatingMethodAccessorImpl.invoke(DelegatingMethodAcces
sorImpl.java:25)
        at java.lang.reflect.Method.invoke(Method.java:585)
        at com.werken.forehead.Forehead.run(Forehead.java:551)
        at com.werken.forehead.Forehead.main(Forehead.java:581)
java.lang.NoClassDefFoundError
        at sun.reflect.NativeConstructorAccessorImpl.newInstance0(Native Method)

        at sun.reflect.NativeConstructorAccessorImpl.newInstance(NativeConstruct
orAccessorImpl.java:39)
        at sun.reflect.DelegatingConstructorAccessorImpl.newInstance(DelegatingC
onstructorAccessorImpl.java:27)
        at java.lang.reflect.Constructor.newInstance(Constructor.java:494)
        at java.lang.Class.newInstance0(Class.java:350)
        at java.lang.Class.newInstance(Class.java:303)
        at org.apache.commons.jelly.tags.ant.AntTag.createTask(AntTag.java:487)
        at org.apache.commons.jelly.tags.ant.AntTag.createTask(AntTag.java:474)
        at org.apache.commons.jelly.tags.ant.AntTag.doTag(AntTag.java:126)
        at org.apache.commons.jelly.impl.TagScript.run(TagScript.java:279)
        at org.apache.commons.jelly.impl.ScriptBlock.run(ScriptBlock.java:135)
        at org.apache.maven.jelly.tags.werkz.MavenGoalTag.runBodyTag(MavenGoalTa
g.java:79)
        at org.apache.maven.jelly.tags.werkz.MavenGoalTag$MavenGoalAction.perfor
mAction(MavenGoalTag.java:110)
        at com.werken.werkz.Goal.fire(Goal.java:639)
        at com.werken.werkz.Goal.attain(Goal.java:575)
        at com.werken.werkz.Goal.attainPrecursors(Goal.java:488)
        at com.werken.werkz.Goal.attain(Goal.java:573)
        at org.apache.maven.plugin.PluginManager.attainGoals(PluginManager.java:
671)
        at org.apache.maven.MavenSession.attainGoals(MavenSession.java:263)
        at org.apache.maven.cli.App.doMain(App.java:488)
        at org.apache.maven.cli.App.main(App.java:1239)
        at sun.reflect.NativeMethodAccessorImpl.invoke0(Native Method)
        at sun.reflect.NativeMethodAccessorImpl.invoke(NativeMethodAccessorImpl.
java:39)
        at sun.reflect.DelegatingMethodAccessorImpl.invoke(DelegatingMethodAcces
sorImpl.java:25)
        at java.lang.reflect.Method.invoke(Method.java:585)
        at com.werken.forehead.Forehead.run(Forehead.java:551)
        at com.werken.forehead.Forehead.main(Forehead.java:581)

Log File

 __  __
|  \/  |__ _Apache__ ___
| |\/| / _` \ V / -_) ' \  ~ intelligent projects ~
|_|  |_\__,_|\_/\___|_||_|  v. 1.0.2

Initializing Plugins!
Set plugin source directory to c:\java\maven-1.0.2\plugins
Set unpacked plugin directory to c:\java\m1-repository\cache
Set user plugin directory to c:\java\m1-repository\plugins
Loading plugin cache
Now mapping cached plugins
Loading plugin 'maven-cruisecontrol-plugin-1.6'
Loading plugin 'maven-multichanges-plugin-1.1'
Loading plugin 'maven-checkstyle-plugin-2.5'
Loading plugin 'maven-file-activity-plugin-1.5.1'
Loading plugin 'maven-jellydoc-plugin-1.3.1'
Loading plugin 'maven-ear-plugin-1.6'
Loading plugin 'maven-jdepend-plugin-1.5'
Loading plugin 'maven-pom-plugin-1.4.1'
Loading plugin 'maven-jira-plugin-1.1.2'
Loading plugin 'maven-jar-plugin-1.6.1'
Loading plugin 'maven-developer-activity-plugin-1.5.1'
Loading plugin 'maven-jboss-plugin-1.5'
Loading plugin 'maven-faq-plugin-1.4'
Loading plugin 'maven-dist-plugin-1.6.1'
Loading plugin 'maven-javadoc-plugin-1.7'
Loading plugin 'maven-linkcheck-plugin-1.3.4'
Loading plugin 'maven-tasklist-plugin-2.3'
Loading plugin 'maven-idea-plugin-1.5'
Loading plugin 'maven-jcoverage-plugin-1.0.9'
Loading plugin 'maven-junit-report-plugin-1.5'
Loading plugin 'maven-plugin-plugin-1.5.2'
Loading plugin 'maven-changelog-plugin-1.7.1'
Loading plugin 'maven-jxr-plugin-1.4.2'
Loading plugin 'maven-ashkelon-plugin-1.2'
Loading plugin 'maven-announcement-plugin-1.3'
Loading plugin 'maven-xdoc-plugin-1.8'
Loading plugin 'maven-eclipse-plugin-1.9'
Loading plugin 'maven-shell-plugin-1.1'
Loading plugin 'maven-rar-plugin-1.0'
Loading plugin 'maven-dashboard-plugin-1.6'
Loading plugin 'maven-scm-plugin-1.4.1'
Loading plugin 'maven-clover-plugin-1.6'
Loading plugin 'maven-uberjar-plugin-1.2'
Loading plugin 'maven-war-plugin-1.6.1'
Loading plugin 'maven-ant-plugin-1.8.1'
Loading plugin 'maven-simian-plugin-1.4'
Loading plugin 'maven-tjdo-plugin-1.0.0'
Loading plugin 'maven-ejb-plugin-1.5'
Loading plugin 'maven-changes-plugin-1.5.1'
Loading plugin 'maven-j2ee-plugin-1.5.1'
Loading plugin 'maven-release-plugin-1.4.1'
Loading plugin 'maven-abbot-plugin-1.1'
Loading plugin 'maven-nsis-plugin-1.1'
Loading plugin 'maven-multiproject-plugin-1.3.1'
Loading plugin 'maven-license-plugin-1.2'
Loading plugin 'maven-jdiff-plugin-1.4'
Loading plugin 'maven-pmd-plugin-1.6'
Loading plugin 'maven-repository-plugin-1.2'
Loading plugin 'maven-jbuilder-plugin-1.5'
Loading plugin 'maven-console-plugin-1.1'
Loading plugin 'maven-webserver-plugin-2.0'
Loading plugin 'maven-aspectwerkz-plugin-1.2'
Loading plugin 'maven-test-plugin-1.6.2'
Loading plugin 'maven-jetty-plugin-1.1'
Loading plugin 'maven-docbook-plugin-1.2'
Loading plugin 'maven-latka-plugin-1.4.1'
Loading plugin 'maven-aspectj-plugin-3.2'
Loading plugin 'maven-hibernate-plugin-1.2'
Loading plugin 'maven-native-plugin-1.1'
Loading plugin 'maven-site-plugin-1.5.2'
Loading plugin 'maven-gump-plugin-1.4'
Loading plugin 'maven-appserver-plugin-2.0'
Loading plugin 'maven-java-plugin-1.5'
Loading plugin 'maven-pdf-plugin-2.2.1'
Loading plugin 'maven-html2xdoc-plugin-1.3.1'
Loading plugin 'maven-jdee-plugin-1.1'
Loading plugin 'maven-jalopy-plugin-1.3.1'
Loading plugin 'maven-jnlp-plugin-1.4.1'
Loading plugin 'maven-jdeveloper-plugin-1.4'
Loading plugin 'maven-junit-doclet-plugin-1.2'
Loading plugin 'maven-wizard-plugin-1.1'
Loading plugin 'maven-artifact-plugin-1.4.1'
Loading plugin 'maven-javacc-plugin-1.1'
Loading plugin 'maven-antlr-plugin-1.2.1'
Loading plugin 'maven-struts-plugin-1.3'
Loading plugin 'maven-clean-plugin-1.3'
Loading plugin 'maven-castor-plugin-1.2'
Loading plugin 'maven-latex-plugin-1.4.1'
Loading plugin 'maven-genapp-plugin-2.2'
Loading plugin 'maven-caller-plugin-1.1'
Loading plugin 'maven-vdoclet-plugin-1.2'
Now loading uncached plugins
Finished initializing Plugins!
Using userBuildPropertiesFile: C:\Documents and Settings\wsmoak\build.properties
Using projectPropertiesFile: c:\svn\struts\current\action\project.properties
Using projectBuildPropertiesFile: c:\svn\struts\current\action\build.properties
Using userBuildPropertiesFile: C:\Documents and Settings\wsmoak\build.properties
Using projectPropertiesFile: C:\svn\struts\current\action\build\project.properties
Using projectBuildPropertiesFile: C:\svn\struts\current\action\build\build.properties
pushing on org.apache.maven.jelly.MavenJellyContext@17431b9 over org.apache.maven.jelly.MavenJellyContext@16c79d7 in struts:struts-action
[DEBUG] Adding reference: maven.dependency.classpath -> C:\java\m1-repository\repository\javax.servlet\jars\servlet-api-2.3.jar;C:\java\m1-repository\repository\commons-beanutils\jars\commons-beanutils-1.7.0.jar;C:\java\m1-repository\repository\commons-chain\jars\commons-chain-1.0.jar;C:\java\m1-repository\repository\commons-digester\jars\commons-digester-1.6.jar;C:\java\m1-repository\repository\commons-fileupload\jars\commons-fileupload-1.1.jar;C:\java\m1-repository\repository\commons-io\jars\commons-io-1.1.jar;C:\java\m1-repository\repository\commons-logging\jars\commons-logging-1.0.4.jar;C:\java\m1-repository\repository\commons-validator\jars\commons-validator-1.2.0.jar;C:\java\m1-repository\repository\oro\jars\oro-2.0.8.jar;C:\java\m1-repository\repository\antlr\jars\antlr-2.7.2.jar;C:\java\m1-repository\repository\junit\jars\junit-3.8.1.jar
running script null
    [available] [VERBOSE] Found: src\java
    [available] [VERBOSE] Found: src\test
[DEBUG] Adding reference: maven-classpath -> 
[DEBUG] Adding reference: maven.compile.src.set -> 
[DEBUG] Adding reference: maven.test.compile.src.set -> 
Verifying dependencies for struts:struts-action
Processing dependencies for project Struts Action Framework; classloader [ForeheadClassLoader: name="root.maven"]
adding dependency c:\java\m1-repository\repository\javax.servlet\jars\servlet-api-2.3.jar into project classloader
adding dependency c:\java\m1-repository\repository\commons-beanutils\jars\commons-beanutils-1.7.0.jar into project classloader
adding dependency c:\java\m1-repository\repository\commons-chain\jars\commons-chain-1.0.jar into project classloader
adding dependency c:\java\m1-repository\repository\commons-digester\jars\commons-digester-1.6.jar into project classloader
adding dependency c:\java\m1-repository\repository\commons-fileupload\jars\commons-fileupload-1.1.jar into project classloader
adding dependency c:\java\m1-repository\repository\commons-io\jars\commons-io-1.1.jar into project classloader
adding dependency c:\java\m1-repository\repository\commons-logging\jars\commons-logging-1.0.4.jar into project classloader
adding dependency c:\java\m1-repository\repository\commons-validator\jars\commons-validator-1.2.0.jar into project classloader
adding dependency c:\java\m1-repository\repository\oro\jars\oro-2.0.8.jar into project classloader
adding dependency c:\java\m1-repository\repository\antlr\jars\antlr-2.7.2.jar into project classloader
adding dependency c:\java\m1-repository\repository\junit\jars\junit-3.8.1.jar into project classloader
running script c:\svn\struts\current\action\maven.xml
running script C:\svn\struts\current\action\build\maven.xml
preparing goal: build:start
execution chain: [[Goal: name="build:start"]; precursor=[]]]
final list of plugins to prepare: []
preparing goal: jalopy
execution chain: [[Goal: name="java:prepare-filesystem"]; precursor=[]], [Goal: name="java:compile"]; precursor=[[Goal: name="java:prepare-filesystem"]; precursor=[]]]], [Goal: name="jalopy:taskdef"]; precursor=[]], [Goal: name="jalopy:format"]; precursor=[[Goal: name="jalopy:taskdef"]; precursor=[]], [Goal: name="java:compile"]; precursor=[[Goal: name="java:prepare-filesystem"]; precursor=[]]]]]], [Goal: name="jalopy"]; precursor=[[Goal: name="jalopy:format"]; precursor=[[Goal: name="jalopy:taskdef"]; precursor=[]], [Goal: name="java:compile"]; precursor=[[Goal: name="java:prepare-filesystem"]; precursor=[]]]]]]]]]
goal java:compile has preGoal decorators [
 source = c:\java\m1-repository\cache\maven-antlr-plugin-1.2.1\plugin.jelly
 project = null
 script = null]
final list of plugins to prepare: [
 source = c:\java\m1-repository\cache\maven-java-plugin-1.5\plugin.jelly
 project = null
 script = null, 
 source = c:\java\m1-repository\cache\maven-antlr-plugin-1.2.1\plugin.jelly
 project = null
 script = null, 
 source = c:\java\m1-repository\cache\maven-jalopy-plugin-1.3.1\plugin.jelly
 project = null
 script = null]
Using userBuildPropertiesFile: C:\Documents and Settings\wsmoak\build.properties
Using projectPropertiesFile: c:\java\m1-repository\cache\maven-java-plugin-1.5\project.properties
Using projectBuildPropertiesFile: c:\java\m1-repository\cache\maven-java-plugin-1.5\build.properties
pushing on org.apache.maven.jelly.MavenJellyContext@1855562 over org.apache.maven.jelly.MavenJellyContext@a89ce3 in maven-java-plugin:maven-java-plugin
initialising plugin housing: Maven Java Plug-in
running script c:\java\m1-repository\cache\maven-java-plugin-1.5\plugin.jelly
Verifying dependencies for maven-java-plugin:maven-java-plugin
Processing dependencies for project Maven Java Plug-in; classloader [ForeheadClassLoader: name="root.maven"]
Using userBuildPropertiesFile: C:\Documents and Settings\wsmoak\build.properties
Using projectPropertiesFile: c:\java\m1-repository\cache\maven-antlr-plugin-1.2.1\project.properties
Using projectBuildPropertiesFile: c:\java\m1-repository\cache\maven-antlr-plugin-1.2.1\build.properties
pushing on org.apache.maven.jelly.MavenJellyContext@1e67e6a over org.apache.maven.jelly.MavenJellyContext@1758500 in maven-antlr-plugin:maven-antlr-plugin
initialising plugin housing: Maven Antlr Plugin
running script c:\java\m1-repository\cache\maven-antlr-plugin-1.2.1\plugin.jelly
Verifying dependencies for maven-antlr-plugin:maven-antlr-plugin
Processing dependencies for project Maven Antlr Plugin; classloader [ForeheadClassLoader: name="root.maven"]
adding dependency c:\java\m1-repository\repository\commons-jelly\jars\commons-jelly-tags-antlr-20030211.143720.jar into project classloader
adding dependency c:\java\m1-repository\repository\commons-lang\jars\commons-lang-2.0.jar into project classloader
DEPRECATION: antlr:antlr in project maven-antlr-plugin:maven-antlr-plugin forces the classloader 'root'
             This behaviour is deprecated. Please refer to the FAQ
poking dependency c:\java\m1-repository\repository\antlr\jars\antlr-2.7.2.jar into classloader root
Using userBuildPropertiesFile: C:\Documents and Settings\wsmoak\build.properties
Using projectPropertiesFile: c:\java\m1-repository\cache\maven-jalopy-plugin-1.3.1\project.properties
Using projectBuildPropertiesFile: c:\java\m1-repository\cache\maven-jalopy-plugin-1.3.1\build.properties
pushing on org.apache.maven.jelly.MavenJellyContext@b32ed4 over org.apache.maven.jelly.MavenJellyContext@1c7980c in maven-jalopy-plugin:maven-jalopy-plugin
initialising plugin housing: Maven Jalopy Plugin
running script c:\java\m1-repository\cache\maven-jalopy-plugin-1.3.1\plugin.jelly
Verifying dependencies for maven-jalopy-plugin:maven-jalopy-plugin
Processing dependencies for project Maven Jalopy Plugin; classloader [ForeheadClassLoader: name="root.maven"]
adding dependency c:\java\m1-repository\repository\jalopy\jars\jalopy-1.0b11.jar into project classloader
adding dependency c:\java\m1-repository\repository\jalopy\jars\jalopy-ant-0.6.2.jar into project classloader
adding dependency c:\java\m1-repository\repository\aelfred\jars\aelfred-1.2.jar into project classloader
adding dependency c:\java\m1-repository\repository\xml-apis\jars\xml-apis-1.0.b2.jar into project classloader
adding dependency c:\java\m1-repository\repository\jdom\jars\jdom-1.0b8.jar into project classloader
adding dependency c:\java\m1-repository\repository\log4j\jars\log4j-1.2.8.jar into project classloader
adding dependency c:\java\m1-repository\repository\oro\jars\oro-2.0.7.jar into project classloader
adding dependency c:\java\m1-repository\repository\textarea\jars\textarea-2.2.3.jar into project classloader
preparing goal: build:end
execution chain: [[Goal: name="build:end"]; precursor=[]]]
final list of plugins to prepare: []
attaining goal build:start
attaining goal jalopy
build:start:

jalopy:taskdef:
    [taskdef] [DEBUG] Finding class de.hunsicker.jalopy.plugin.ant.AntPlugin
    [taskdef] [DEBUG] Class org.apache.tools.ant.Task loaded from parent loader
    [taskdef] [DEBUG] Class de.hunsicker.jalopy.plugin.ant.AntPlugin loaded from ant loader
    [taskdef] [DEBUG] Class java.lang.Object loaded from parent loader
    [taskdef] [DEBUG] Class java.util.List loaded from parent loader
    [taskdef] [DEBUG] Class java.lang.Throwable loaded from parent loader
    [taskdef] [DEBUG] Class java.io.FileNotFoundException loaded from parent loader
    [taskdef] [DEBUG] Class java.lang.IllegalArgumentException loaded from parent loader
    [taskdef] [DEBUG] Class org.apache.log4j.Priority loaded from parent loader
    [taskdef] [DEBUG] Class org.apache.log4j.Level loaded from parent loader
    [taskdef] [DEBUG] Class org.apache.tools.ant.BuildException loaded from parent loader
    [taskdef] [DEBUG] Class java.io.IOException loaded from parent loader
    [taskdef] [DEBUG] Class java.lang.NumberFormatException loaded from parent loader
    [taskdef] [DEBUG] Class org.apache.log4j.Appender loaded from parent loader
    [taskdef] [DEBUG] Finding class de.hunsicker.jalopy.storage.Convention
    [taskdef] [DEBUG] Class de.hunsicker.jalopy.storage.Convention loaded from ant loader
    [taskdef] [DEBUG] Class java.util.Map loaded from parent loader
    [taskdef] [DEBUG] Class java.io.InputStream loaded from parent loader
    [taskdef] [DEBUG] Class java.io.BufferedInputStream loaded from parent loader
    [taskdef] [DEBUG] Class java.io.OutputStream loaded from parent loader
    [taskdef] [DEBUG] Class java.io.BufferedOutputStream loaded from parent loader
    [taskdef] [DEBUG] Class java.io.FileOutputStream loaded from parent loader
    [taskdef] [DEBUG] Class java.net.MalformedURLException loaded from parent loader
    [taskdef] [DEBUG] Finding class de.hunsicker.util.ChainingRuntimeException
    [taskdef] [DEBUG] Class java.lang.RuntimeException loaded from parent loader
    [taskdef] [DEBUG] Class de.hunsicker.util.ChainingRuntimeException loaded from ant loader
    [taskdef] [DEBUG] Finding class org.jdom.JDOMException
    [taskdef] [DEBUG] Class java.lang.Exception loaded from parent loader
    [taskdef] [DEBUG] Class org.jdom.JDOMException loaded from ant loader
    [taskdef] [DEBUG] Class java.io.Reader loaded from parent loader
    [taskdef] [DEBUG] Class java.io.InputStreamReader loaded from parent loader
    [taskdef] [DEBUG] Class java.io.FileInputStream loaded from parent loader
    [taskdef] [DEBUG] Class java.io.FilenameFilter loaded from parent loader
    [taskdef] [DEBUG] Class java.lang.ClassNotFoundException loaded from parent loader
    [taskdef] [DEBUG] Class java.lang.NoClassDefFoundError loaded from parent loader
    [taskdef] [DEBUG] Class java.lang.NullPointerException loaded from parent loader
    [taskdef] [DEBUG] Class java.lang.String loaded from parent loader
    [taskdef] [DEBUG] Class java.util.HashMap loaded from parent loader
    [taskdef] [DEBUG] Finding class de.hunsicker.jalopy.storage.Project
    [taskdef] [DEBUG] Class java.io.Serializable loaded from parent loader
    [taskdef] [DEBUG] Class de.hunsicker.jalopy.storage.Project loaded from ant loader
    [taskdef] [DEBUG] Class java.io.File loaded from parent loader
    [taskdef] [DEBUG] Class java.lang.StringBuffer loaded from parent loader
    [taskdef] [DEBUG] Class java.lang.System loaded from parent loader
    [taskdef] [DEBUG] Finding class de.hunsicker.io.IoHelper
    [taskdef] [DEBUG] Class de.hunsicker.io.IoHelper loaded from ant loader
    [taskdef] [DEBUG] Class java.io.ByteArrayInputStream loaded from parent loader
    [taskdef] [DEBUG] Class java.io.ObjectInputStream loaded from parent loader
    [taskdef] [DEBUG] Class java.util.Set loaded from parent loader
    [taskdef] [DEBUG] Class java.util.Iterator loaded from parent loader
    [taskdef] [DEBUG] Finding class de.hunsicker.jalopy.prefs.Key
    [taskdef] [DEBUG] Class de.hunsicker.jalopy.prefs.Key loaded from ant loader
    [taskdef] [DEBUG] Finding class de.hunsicker.jalopy.storage.ConventionKeys
    [taskdef] [DEBUG] Class de.hunsicker.jalopy.storage.ConventionKeys loaded from ant loader
    [taskdef] [DEBUG] Class java.lang.IllegalAccessException loaded from parent loader
    [taskdef] [DEBUG] Finding class de.hunsicker.jalopy.storage.Convention$Key
    [taskdef] [DEBUG] Class java.lang.Comparable loaded from parent loader
    [taskdef] [DEBUG] Class de.hunsicker.jalopy.storage.Convention$Key loaded from ant loader
    [taskdef] [DEBUG] Class java.lang.Integer loaded from parent loader
    [taskdef] [DEBUG] Finding class de.hunsicker.jalopy.storage.Loggers
    [taskdef] [DEBUG] Class de.hunsicker.jalopy.storage.Loggers loaded from ant loader
    [taskdef] [DEBUG] Class org.apache.log4j.Logger loaded from parent loader
    [taskdef] [DEBUG] Class java.util.ResourceBundle loaded from parent loader
    [taskdef] [DEBUG]  +User task: jalopy     de.hunsicker.jalopy.plugin.ant.AntPlugin

java:prepare-filesystem:

java:compile:
    [echo] Compiling to c:\svn\struts\current\action/target/classes
    [javac] [DEBUG] fileset: Setup scanner in dir C:\svn\struts\current\action\src\java with patternSet{ includes: [] excludes: [**/package.html] }
    [javac] [VERBOSE] org\apache\struts\action\Action.java omitted as org/apache/struts/action/Action.class is up to date.
    [javac] [VERBOSE] org\apache\struts\action\ActionErrors.java omitted as org/apache/struts/action/ActionErrors.class is up to date.
    [javac] [VERBOSE] org\apache\struts\action\ActionForm.java omitted as org/apache/struts/action/ActionForm.class is up to date.
    [javac] [VERBOSE] org\apache\struts\action\ActionFormBean.java omitted as org/apache/struts/action/ActionFormBean.class is up to date.
    [javac] [VERBOSE] org\apache\struts\action\ActionForward.java omitted as org/apache/struts/action/ActionForward.class is up to date.
    [javac] [VERBOSE] org\apache\struts\action\ActionMapping.java omitted as org/apache/struts/action/ActionMapping.class is up to date.
    [javac] [VERBOSE] org\apache\struts\action\ActionMessage.java omitted as org/apache/struts/action/ActionMessage.class is up to date.
    [javac] [VERBOSE] org\apache\struts\action\ActionMessages.java omitted as org/apache/struts/action/ActionMessages.class is up to date.
    [javac] [VERBOSE] org\apache\struts\action\ActionRedirect.java omitted as org/apache/struts/action/ActionRedirect.class is up to date.
    [javac] [VERBOSE] org\apache\struts\action\ActionResources.properties skipped - don't know how to handle it
    [javac] [VERBOSE] org\apache\struts\action\ActionResources_ja.properties skipped - don't know how to handle it
    [javac] [VERBOSE] org\apache\struts\action\ActionServlet.java omitted as org/apache/struts/action/ActionServlet.class is up to date.
    [javac] [VERBOSE] org\apache\struts\action\ActionServletWrapper.java omitted as org/apache/struts/action/ActionServletWrapper.class is up to date.
    [javac] [VERBOSE] org\apache\struts\action\doc-files\actionUML.gif skipped - don't know how to handle it
    [javac] [VERBOSE] org\apache\struts\action\DynaActionForm.java omitted as org/apache/struts/action/DynaActionForm.class is up to date.
    [javac] [VERBOSE] org\apache\struts\action\DynaActionFormClass.java omitted as org/apache/struts/action/DynaActionFormClass.class is up to date.
    [javac] [VERBOSE] org\apache\struts\action\ExceptionHandler.java omitted as org/apache/struts/action/ExceptionHandler.class is up to date.
    [javac] [VERBOSE] org\apache\struts\action\ForwardingActionForward.java omitted as org/apache/struts/action/ForwardingActionForward.class is up to date.
    [javac] [VERBOSE] org\apache\struts\action\LocalStrings.properties skipped - don't know how to handle it
    [javac] [VERBOSE] org\apache\struts\action\LocalStrings_ja.properties skipped - don't know how to handle it
    [javac] [VERBOSE] org\apache\struts\action\PlugIn.java omitted as org/apache/struts/action/PlugIn.class is up to date.
    [javac] [VERBOSE] org\apache\struts\action\RedirectingActionForward.java omitted as org/apache/struts/action/RedirectingActionForward.class is up to date.
    [javac] [VERBOSE] org\apache\struts\action\RequestActionMapping.java omitted as org/apache/struts/action/RequestActionMapping.class is up to date.
    [javac] [VERBOSE] org\apache\struts\action\RequestProcessor.java omitted as org/apache/struts/action/RequestProcessor.class is up to date.
    [javac] [VERBOSE] org\apache\struts\action\SessionActionMapping.java omitted as org/apache/struts/action/SessionActionMapping.class is up to date.
    [javac] [VERBOSE] org\apache\struts\chain\commands\AbstractAuthorizeAction.java omitted as org/apache/struts/chain/commands/AbstractAuthorizeAction.class is up to date.
    [javac] [VERBOSE] org\apache\struts\chain\commands\AbstractCreateAction.java omitted as org/apache/struts/chain/commands/AbstractCreateAction.class is up to date.
    [javac] [VERBOSE] org\apache\struts\chain\commands\AbstractExceptionHandler.java omitted as org/apache/struts/chain/commands/AbstractExceptionHandler.class is up to date.
    [javac] [VERBOSE] org\apache\struts\chain\commands\AbstractExecuteAction.java omitted as org/apache/struts/chain/commands/AbstractExecuteAction.class is up to date.
    [javac] [VERBOSE] org\apache\struts\chain\commands\AbstractPerformForward.java omitted as org/apache/struts/chain/commands/AbstractPerformForward.class is up to date.
    [javac] [VERBOSE] org\apache\struts\chain\commands\AbstractPerformInclude.java omitted as org/apache/struts/chain/commands/AbstractPerformInclude.class is up to date.
    [javac] [VERBOSE] org\apache\struts\chain\commands\AbstractPopulateActionForm.java omitted as org/apache/struts/chain/commands/AbstractPopulateActionForm.class is up to date.
    [javac] [VERBOSE] org\apache\struts\chain\commands\AbstractRequestNoCache.java omitted as org/apache/struts/chain/commands/AbstractRequestNoCache.class is up to date.
    [javac] [VERBOSE] org\apache\struts\chain\commands\AbstractSelectAction.java omitted as org/apache/struts/chain/commands/AbstractSelectAction.class is up to date.
    [javac] [VERBOSE] org\apache\struts\chain\commands\AbstractSelectForward.java omitted as org/apache/struts/chain/commands/AbstractSelectForward.class is up to date.
    [javac] [VERBOSE] org\apache\struts\chain\commands\AbstractSelectInput.java omitted as org/apache/struts/chain/commands/AbstractSelectInput.class is up to date.
    [javac] [VERBOSE] org\apache\struts\chain\commands\AbstractSelectLocale.java omitted as org/apache/struts/chain/commands/AbstractSelectLocale.class is up to date.
    [javac] [VERBOSE] org\apache\struts\chain\commands\AbstractSelectModule.java omitted as org/apache/struts/chain/commands/AbstractSelectModule.class is up to date.
    [javac] [VERBOSE] org\apache\struts\chain\commands\AbstractSetContentType.java omitted as org/apache/struts/chain/commands/AbstractSetContentType.class is up to date.
    [javac] [VERBOSE] org\apache\struts\chain\commands\AbstractSetOriginalURI.java omitted as org/apache/struts/chain/commands/AbstractSetOriginalURI.class is up to date.
    [javac] [VERBOSE] org\apache\struts\chain\commands\AbstractValidateActionForm.java omitted as org/apache/struts/chain/commands/AbstractValidateActionForm.class is up to date.
    [javac] [VERBOSE] org\apache\struts\chain\commands\ActionCommand.java omitted as org/apache/struts/chain/commands/ActionCommand.class is up to date.
    [javac] [VERBOSE] org\apache\struts\chain\commands\ActionCommandBase.java omitted as org/apache/struts/chain/commands/ActionCommandBase.class is up to date.
    [javac] [VERBOSE] org\apache\struts\chain\commands\CreateActionForm.java omitted as org/apache/struts/chain/commands/CreateActionForm.class is up to date.
    [javac] [VERBOSE] org\apache\struts\chain\commands\ExceptionCatcher.java omitted as org/apache/struts/chain/commands/ExceptionCatcher.class is up to date.
    [javac] [VERBOSE] org\apache\struts\chain\commands\ExecuteCommand.java omitted as org/apache/struts/chain/commands/ExecuteCommand.class is up to date.
    [javac] [VERBOSE] org\apache\struts\chain\commands\ExecuteForwardCommand.java omitted as org/apache/struts/chain/commands/ExecuteForwardCommand.class is up to date.
    [javac] [VERBOSE] org\apache\struts\chain\commands\generic\CopyFormToContext.java omitted as org/apache/struts/chain/commands/generic/CopyFormToContext.class is up to date.
    [javac] [VERBOSE] org\apache\struts\chain\commands\generic\WrappingLookupCommand.java omitted as org/apache/struts/chain/commands/generic/WrappingLookupCommand.class is up to date.
    [javac] [VERBOSE] org\apache\struts\chain\commands\InvalidPathException.java omitted as org/apache/struts/chain/commands/InvalidPathException.class is up to date.
    [javac] [VERBOSE] org\apache\struts\chain\commands\SelectInclude.java omitted as org/apache/struts/chain/commands/SelectInclude.class is up to date.
    [javac] [VERBOSE] org\apache\struts\chain\commands\servlet\AuthorizeAction.java omitted as org/apache/struts/chain/commands/servlet/AuthorizeAction.class is up to date.
    [javac] [VERBOSE] org\apache\struts\chain\commands\servlet\CreateAction.java omitted as org/apache/struts/chain/commands/servlet/CreateAction.class is up to date.
    [javac] [VERBOSE] org\apache\struts\chain\commands\servlet\ExceptionHandler.java omitted as org/apache/struts/chain/commands/servlet/ExceptionHandler.class is up to date.
    [javac] [VERBOSE] org\apache\struts\chain\commands\servlet\ExecuteAction.java omitted as org/apache/struts/chain/commands/servlet/ExecuteAction.class is up to date.
    [javac] [VERBOSE] org\apache\struts\chain\commands\servlet\PerformForward.java omitted as org/apache/struts/chain/commands/servlet/PerformForward.class is up to date.
    [javac] [VERBOSE] org\apache\struts\chain\commands\servlet\PerformInclude.java omitted as org/apache/struts/chain/commands/servlet/PerformInclude.class is up to date.
    [javac] [VERBOSE] org\apache\struts\chain\commands\servlet\PopulateActionForm.java omitted as org/apache/struts/chain/commands/servlet/PopulateActionForm.class is up to date.
    [javac] [VERBOSE] org\apache\struts\chain\commands\servlet\RequestNoCache.java omitted as org/apache/struts/chain/commands/servlet/RequestNoCache.class is up to date.
    [javac] [VERBOSE] org\apache\struts\chain\commands\servlet\SelectAction.java omitted as org/apache/struts/chain/commands/servlet/SelectAction.class is up to date.
    [javac] [VERBOSE] org\apache\struts\chain\commands\servlet\SelectForward.java omitted as org/apache/struts/chain/commands/servlet/SelectForward.class is up to date.
    [javac] [VERBOSE] org\apache\struts\chain\commands\servlet\SelectInput.java omitted as org/apache/struts/chain/commands/servlet/SelectInput.class is up to date.
    [javac] [VERBOSE] org\apache\struts\chain\commands\servlet\SelectLocale.java omitted as org/apache/struts/chain/commands/servlet/SelectLocale.class is up to date.
    [javac] [VERBOSE] org\apache\struts\chain\commands\servlet\SelectModule.java omitted as org/apache/struts/chain/commands/servlet/SelectModule.class is up to date.
    [javac] [VERBOSE] org\apache\struts\chain\commands\servlet\SetContentType.java omitted as org/apache/struts/chain/commands/servlet/SetContentType.class is up to date.
    [javac] [VERBOSE] org\apache\struts\chain\commands\servlet\SetOriginalURI.java omitted as org/apache/struts/chain/commands/servlet/SetOriginalURI.class is up to date.
    [javac] [VERBOSE] org\apache\struts\chain\commands\servlet\ValidateActionForm.java omitted as org/apache/struts/chain/commands/servlet/ValidateActionForm.class is up to date.
    [javac] [VERBOSE] org\apache\struts\chain\commands\UnauthorizedActionException.java omitted as org/apache/struts/chain/commands/UnauthorizedActionException.class is up to date.
    [javac] [VERBOSE] org\apache\struts\chain\commands\util\ClassUtils.java omitted as org/apache/struts/chain/commands/util/ClassUtils.class is up to date.
    [javac] [VERBOSE] org\apache\struts\chain\ComposableRequestProcessor.java omitted as org/apache/struts/chain/ComposableRequestProcessor.class is up to date.
    [javac] [VERBOSE] org\apache\struts\chain\Constants.java omitted as org/apache/struts/chain/Constants.class is up to date.
    [javac] [VERBOSE] org\apache\struts\chain\contexts\ActionContext.java omitted as org/apache/struts/chain/contexts/ActionContext.class is up to date.
    [javac] [VERBOSE] org\apache\struts\chain\contexts\ActionContextBase.java omitted as org/apache/struts/chain/contexts/ActionContextBase.class is up to date.
    [javac] [VERBOSE] org\apache\struts\chain\contexts\ContextWrapper.java omitted as org/apache/struts/chain/contexts/ContextWrapper.class is up to date.
    [javac] [VERBOSE] org\apache\struts\chain\contexts\MockActionContext.java omitted as org/apache/struts/chain/contexts/MockActionContext.class is up to date.
    [javac] [VERBOSE] org\apache\struts\chain\contexts\ServletActionContext.java omitted as org/apache/struts/chain/contexts/ServletActionContext.class is up to date.
    [javac] [VERBOSE] org\apache\struts\chain\contexts\WebActionContext.java omitted as org/apache/struts/chain/contexts/WebActionContext.class is up to date.
    [javac] [VERBOSE] org\apache\struts\config\ActionConfig.java omitted as org/apache/struts/config/ActionConfig.class is up to date.
    [javac] [VERBOSE] org\apache\struts\config\ActionConfigMatcher.java omitted as org/apache/struts/config/ActionConfigMatcher.class is up to date.
    [javac] [VERBOSE] org\apache\struts\config\BaseConfig.java omitted as org/apache/struts/config/BaseConfig.class is up to date.
    [javac] [VERBOSE] org\apache\struts\config\ConfigHelper.java omitted as org/apache/struts/config/ConfigHelper.class is up to date.
    [javac] [VERBOSE] org\apache\struts\config\ConfigHelperInterface.java omitted as org/apache/struts/config/ConfigHelperInterface.class is up to date.
    [javac] [VERBOSE] org\apache\struts\config\ConfigRuleSet.java omitted as org/apache/struts/config/ConfigRuleSet.class is up to date.
    [javac] [VERBOSE] org\apache\struts\config\ControllerConfig.java omitted as org/apache/struts/config/ControllerConfig.class is up to date.
    [javac] [VERBOSE] org\apache\struts\config\doc-files\configUML.gif skipped - don't know how to handle it
    [javac] [VERBOSE] org\apache\struts\config\ExceptionConfig.java omitted as org/apache/struts/config/ExceptionConfig.class is up to date.
    [javac] [VERBOSE] org\apache\struts\config\FormBeanConfig.java omitted as org/apache/struts/config/FormBeanConfig.class is up to date.
    [javac] [VERBOSE] org\apache\struts\config\FormPropertyConfig.java omitted as org/apache/struts/config/FormPropertyConfig.class is up to date.
    [javac] [VERBOSE] org\apache\struts\config\ForwardConfig.java omitted as org/apache/struts/config/ForwardConfig.class is up to date.
    [javac] [VERBOSE] org\apache\struts\config\impl\DefaultModuleConfigFactory.java omitted as org/apache/struts/config/impl/DefaultModuleConfigFactory.class is up to date.
    [javac] [VERBOSE] org\apache\struts\config\impl\ModuleConfigImpl.java omitted as org/apache/struts/config/impl/ModuleConfigImpl.class is up to date.
    [javac] [VERBOSE] org\apache\struts\config\MessageResourcesConfig.java omitted as org/apache/struts/config/MessageResourcesConfig.class is up to date.
    [javac] [VERBOSE] org\apache\struts\config\ModuleConfig.java omitted as org/apache/struts/config/ModuleConfig.class is up to date.
    [javac] [VERBOSE] org\apache\struts\config\ModuleConfigFactory.java omitted as org/apache/struts/config/ModuleConfigFactory.class is up to date.
    [javac] [VERBOSE] org\apache\struts\config\PlugInConfig.java omitted as org/apache/struts/config/PlugInConfig.class is up to date.
    [javac] [VERBOSE] org\apache\struts\doc-files\jakarta-feather-small.gif skipped - don't know how to handle it
    [javac] [VERBOSE] org\apache\struts\doc-files\Stamp.gif skipped - don't know how to handle it
    [javac] [VERBOSE] org\apache\struts\Globals.java omitted as org/apache/struts/Globals.class is up to date.
    [javac] [VERBOSE] org\apache\struts\mock\MockAction.java omitted as org/apache/struts/mock/MockAction.class is up to date.
    [javac] [VERBOSE] org\apache\struts\mock\MockActionServlet.java omitted as org/apache/struts/mock/MockActionServlet.class is up to date.
    [javac] [VERBOSE] org\apache\struts\mock\MockEnumeration.java omitted as org/apache/struts/mock/MockEnumeration.class is up to date.
    [javac] [VERBOSE] org\apache\struts\mock\MockFormBean.java omitted as org/apache/struts/mock/MockFormBean.class is up to date.
    [javac] [VERBOSE] org\apache\struts\mock\MockHttpServletRequest.java omitted as org/apache/struts/mock/MockHttpServletRequest.class is up to date.
    [javac] [VERBOSE] org\apache\struts\mock\MockHttpServletResponse.java omitted as org/apache/struts/mock/MockHttpServletResponse.class is up to date.
    [javac] [VERBOSE] org\apache\struts\mock\MockHttpSession.java omitted as org/apache/struts/mock/MockHttpSession.class is up to date.
    [javac] [VERBOSE] org\apache\struts\mock\MockPageContext.java omitted as org/apache/struts/mock/MockPageContext.class is up to date.
    [javac] [VERBOSE] org\apache\struts\mock\MockPrincipal.java omitted as org/apache/struts/mock/MockPrincipal.class is up to date.
    [javac] [VERBOSE] org\apache\struts\mock\MockServletConfig.java omitted as org/apache/struts/mock/MockServletConfig.class is up to date.
    [javac] [VERBOSE] org\apache\struts\mock\MockServletContext.java omitted as org/apache/struts/mock/MockServletContext.class is up to date.
    [javac] [VERBOSE] org\apache\struts\mock\TestMockBase.java omitted as org/apache/struts/mock/TestMockBase.class is up to date.
    [javac] [VERBOSE] org\apache\struts\upload\CommonsMultipartRequestHandler.java omitted as org/apache/struts/upload/CommonsMultipartRequestHandler.class is up to date.
    [javac] [VERBOSE] org\apache\struts\upload\doc-files\uploadUML.jpg skipped - don't know how to handle it
    [javac] [VERBOSE] org\apache\struts\upload\FormFile.java omitted as org/apache/struts/upload/FormFile.class is up to date.
    [javac] [VERBOSE] org\apache\struts\upload\MultipartRequestHandler.java omitted as org/apache/struts/upload/MultipartRequestHandler.class is up to date.
    [javac] [VERBOSE] org\apache\struts\upload\MultipartRequestWrapper.java omitted as org/apache/struts/upload/MultipartRequestWrapper.class is up to date.
    [javac] [VERBOSE] org\apache\struts\util\ImageButtonBean.java omitted as org/apache/struts/util/ImageButtonBean.class is up to date.
    [javac] [VERBOSE] org\apache\struts\util\IteratorAdapter.java omitted as org/apache/struts/util/IteratorAdapter.class is up to date.
    [javac] [VERBOSE] org\apache\struts\util\LabelValueBean.java omitted as org/apache/struts/util/LabelValueBean.class is up to date.
    [javac] [VERBOSE] org\apache\struts\util\LocalStrings.properties skipped - don't know how to handle it
    [javac] [VERBOSE] org\apache\struts\util\LocalStrings_ja.properties skipped - don't know how to handle it
    [javac] [VERBOSE] org\apache\struts\util\MessageResources.java omitted as org/apache/struts/util/MessageResources.class is up to date.
    [javac] [VERBOSE] org\apache\struts\util\MessageResourcesFactory.java omitted as org/apache/struts/util/MessageResourcesFactory.class is up to date.
    [javac] [VERBOSE] org\apache\struts\util\ModuleException.java omitted as org/apache/struts/util/ModuleException.class is up to date.
    [javac] [VERBOSE] org\apache\struts\util\ModuleUtils.java omitted as org/apache/struts/util/ModuleUtils.class is up to date.
    [javac] [VERBOSE] org\apache\struts\util\PropertyMessageResources.java omitted as org/apache/struts/util/PropertyMessageResources.class is up to date.
    [javac] [VERBOSE] org\apache\struts\util\PropertyMessageResourcesFactory.java omitted as org/apache/struts/util/PropertyMessageResourcesFactory.class is up to date.
    [javac] [VERBOSE] org\apache\struts\util\RequestUtils.java omitted as org/apache/struts/util/RequestUtils.class is up to date.
    [javac] [VERBOSE] org\apache\struts\util\ResponseUtils.java omitted as org/apache/struts/util/ResponseUtils.class is up to date.
    [javac] [VERBOSE] org\apache\struts\util\ServletContextWriter.java omitted as org/apache/struts/util/ServletContextWriter.class is up to date.
    [javac] [VERBOSE] org\apache\struts\util\TokenProcessor.java omitted as org/apache/struts/util/TokenProcessor.class is up to date.
    [javac] [VERBOSE] org\apache\struts\util\WildcardHelper.java omitted as org/apache/struts/util/WildcardHelper.class is up to date.
    [javac] [VERBOSE] org\apache\struts\validator\BeanValidatorForm.java omitted as org/apache/struts/validator/BeanValidatorForm.class is up to date.
    [javac] [VERBOSE] org\apache\struts\validator\doc-files\validatorUML.jpg skipped - don't know how to handle it
    [javac] [VERBOSE] org\apache\struts\validator\DynaValidatorActionForm.java omitted as org/apache/struts/validator/DynaValidatorActionForm.class is up to date.
    [javac] [VERBOSE] org\apache\struts\validator\DynaValidatorForm.java omitted as org/apache/struts/validator/DynaValidatorForm.class is up to date.
    [javac] [VERBOSE] org\apache\struts\validator\FieldChecks.java omitted as org/apache/struts/validator/FieldChecks.class is up to date.
    [javac] [VERBOSE] org\apache\struts\validator\LazyValidatorForm.java omitted as org/apache/struts/validator/LazyValidatorForm.class is up to date.
    [javac] [VERBOSE] org\apache\struts\validator\LocalStrings.properties skipped - don't know how to handle it
    [javac] [VERBOSE] org\apache\struts\validator\Resources.java omitted as org/apache/struts/validator/Resources.class is up to date.
    [javac] [VERBOSE] org\apache\struts\validator\ValidatorActionForm.java omitted as org/apache/struts/validator/ValidatorActionForm.class is up to date.
    [javac] [VERBOSE] org\apache\struts\validator\ValidatorForm.java omitted as org/apache/struts/validator/ValidatorForm.class is up to date.
    [javac] [VERBOSE] org\apache\struts\validator\ValidatorPlugIn.java omitted as org/apache/struts/validator/ValidatorPlugIn.class is up to date.
    [javac] [VERBOSE] org\apache\struts\validator\validwhen\readme.txt skipped - don't know how to handle it
    [javac] [VERBOSE] org\apache\struts\validator\validwhen\ValidWhen.java omitted as org/apache/struts/validator/validwhen/ValidWhen.class is up to date.
    [javac] [VERBOSE] org\apache\struts\validator\validwhen\ValidWhenLexer.java omitted as org/apache/struts/validator/validwhen/ValidWhenLexer.class is up to date.
    [javac] [VERBOSE] org\apache\struts\validator\validwhen\ValidWhenParser.g skipped - don't know how to handle it
    [javac] [VERBOSE] org\apache\struts\validator\validwhen\ValidWhenParser.java omitted as org/apache/struts/validator/validwhen/ValidWhenParser.class is up to date.
    [javac] [VERBOSE] org\apache\struts\validator\validwhen\ValidWhenParserTokenTypes.java omitted as org/apache/struts/validator/validwhen/ValidWhenParserTokenTypes.class is up to date.
    [javac] [VERBOSE] org\apache\struts\validator\validwhen\ValidWhenParserTokenTypes.txt skipped - don't know how to handle it

jalopy:format:
[DEBUG] Adding reference: project.classpath -> 
popping off org.apache.maven.jelly.MavenJellyContext@b32ed4 for org.apache.maven.jelly.MavenJellyContext@1c7980c in maven-jalopy-plugin:maven-jalopy-plugin
popping off org.apache.maven.jelly.MavenJellyContext@1855562 for org.apache.maven.jelly.MavenJellyContext@a89ce3 in maven-java-plugin:maven-java-plugin
popping off org.apache.maven.jelly.MavenJellyContext@1e67e6a for org.apache.maven.jelly.MavenJellyContext@1758500 in maven-antlr-plugin:maven-antlr-plugin
popping off org.apache.maven.jelly.MavenJellyContext@17431b9 for org.apache.maven.jelly.MavenJellyContext@16c79d7 in struts:struts-action
Root cause
Final Memory: 2M/5M
Total time: 2 seconds
Finished at: Tue Feb 07 22:27:04 GMT-07:00 2006


HomePage | Maven | RecentChanges | Preferences
This page is read-only | View other revisions
Last edited February 10, 2006 8:07 pm by WendySmoak (diff)
Search: