StrutsBuild

HomePage | RecentChanges | Preferences

April 28, 2006

TestModuleConfig? needs an Internet connection?

[INFO] Building Struts Action - Core
[INFO]    task-segment: [clean, install, site]
[INFO] -------------------------------------------------------------------------
---
[INFO] [clean:clean]
[INFO] Deleting directory c:\svn\struts\current\action\core\target
[INFO] Deleting directory c:\svn\struts\current\action\core\target\classes
[INFO] Deleting directory c:\svn\struts\current\action\core\target\test-classes
[INFO] [resources:resources]
[INFO] Using default encoding to copy filtered resources.
[INFO] [compiler:compile]
Compiling 133 source files to c:\svn\struts\current\action\core\target\classes
[INFO] [resources:testResources]
[INFO] Using default encoding to copy filtered resources.
[INFO] [compiler:testCompile]
Compiling 22 source files to c:\svn\struts\current\action\core\target\test-class
es
[INFO] [surefire:test]
[INFO] Setting reports dir: c:\svn\struts\current\action\core\target/surefire-re
ports

-------------------------------------------------------
 T E S T S
-------------------------------------------------------
[surefire] Running org.apache.struts.action.TestActionMessage
[surefire] Tests run: 8, Failures: 0, Errors: 0, Time elapsed: 0.063 sec
[surefire] Running org.apache.struts.action.TestActionMessages
[surefire] Tests run: 8, Failures: 0, Errors: 0, Time elapsed: 0.015 sec
[surefire] Running org.apache.struts.action.TestActionRedirect
[surefire] Tests run: 5, Failures: 0, Errors: 0, Time elapsed: 0.047 sec
[surefire] Running org.apache.struts.action.TestActionServlet
Apr 28, 2006 11:06:07 PM org.apache.struts.util.PropertyMessageResources loadLoc
ale
WARNING:   Resource Not Found.
Apr 28, 2006 11:06:07 PM org.apache.struts.action.ActionServlet handleValueRequi
redException
SEVERE: Missing type value for noTypeForm form bean
Apr 28, 2006 11:06:07 PM org.apache.struts.util.PropertyMessageResources loadLoc
ale
WARNING:   Resource Not Found.
Apr 28, 2006 11:06:07 PM org.apache.struts.action.ActionServlet handleValueRequi
redException
SEVERE: Missing type value for name form property
Apr 28, 2006 11:06:07 PM org.apache.struts.util.PropertyMessageResources loadLoc
ale
WARNING:   Resource Not Found.
Apr 28, 2006 11:06:07 PM org.apache.struts.action.ActionServlet handleValueRequi
redException
SEVERE: Missing key value for java.lang.NullPointerException global exception co
nfig
Apr 28, 2006 11:06:07 PM org.apache.struts.util.PropertyMessageResources loadLoc
ale
WARNING:   Resource Not Found.
Apr 28, 2006 11:06:07 PM org.apache.struts.action.ActionServlet handleValueRequi
redException
SEVERE: Missing path value for success global forward
[surefire] Tests run: 29, Failures: 0, Errors: 0, Time elapsed: 0.234 sec
[surefire] Running org.apache.struts.action.TestDynaActionForm
[surefire] Tests run: 46, Failures: 0, Errors: 0, Time elapsed: 0.094 sec
[surefire] Running org.apache.struts.action.TestDynaActionFormClass
[surefire] Tests run: 7, Failures: 0, Errors: 0, Time elapsed: 0.032 sec
[surefire] Running org.apache.struts.chain.commands.generic.TestCopyFormToContex
t
[surefire] Tests run: 6, Failures: 0, Errors: 0, Time elapsed: 0.047 sec
[surefire] Running org.apache.struts.chain.commands.generic.TestWrappingLookupCo
mmand
[surefire] Tests run: 2, Failures: 0, Errors: 0, Time elapsed: 0.016 sec
[surefire] Running org.apache.struts.chain.commands.servlet.TestAuthorizeAction
Apr 28, 2006 11:06:07 PM org.apache.struts.util.PropertyMessageResources loadLoc
ale
WARNING:   Resource Not Found.
Apr 28, 2006 11:06:07 PM org.apache.struts.util.PropertyMessageResources loadLoc
ale
WARNING:   Resource Not Found.
[surefire] Tests run: 5, Failures: 0, Errors: 0, Time elapsed: 0.031 sec
[surefire] Running org.apache.struts.chain.commands.servlet.TestPerformForward
Apr 28, 2006 11:06:07 PM org.apache.struts.util.PropertyMessageResources loadLoc
ale
WARNING:   Resource Not Found.
exception: The path of an ForwardConfig cannot be null
[surefire] Tests run: 1, Failures: 0, Errors: 0, Time elapsed: 0.016 sec
[surefire] Running org.apache.struts.chain.commands.servlet.TestSetOriginalURI
[surefire] Tests run: 1, Failures: 0, Errors: 0, Time elapsed: 0.016 sec
[surefire] Running org.apache.struts.config.TestActionConfig
[surefire] Tests run: 5, Failures: 0, Errors: 0, Time elapsed: 0.015 sec
[surefire] Running org.apache.struts.config.TestActionConfigMatcher
[surefire] Tests run: 6, Failures: 0, Errors: 0, Time elapsed: 0.063 sec
[surefire] Running org.apache.struts.config.TestFormBeanConfig
[surefire] Tests run: 5, Failures: 0, Errors: 0, Time elapsed: 0.063 sec
[surefire] Running org.apache.struts.config.TestFormPropertyConfig
[surefire] Tests run: 5, Failures: 0, Errors: 0, Time elapsed: 0.015 sec
[surefire] Running org.apache.struts.config.TestForwardConfig
[surefire] Tests run: 15, Failures: 0, Errors: 0, Time elapsed: 0.032 sec
[surefire] Running org.apache.struts.config.TestModuleConfig
java.net.ConnectException: Connection timed out: connect
        at java.net.PlainSocketImpl.socketConnect(Native Method)
        at java.net.PlainSocketImpl.doConnect(PlainSocketImpl.java:333)
        at java.net.PlainSocketImpl.connectToAddress(PlainSocketImpl.java:195)
        at java.net.PlainSocketImpl.connect(PlainSocketImpl.java:182)
        at java.net.Socket.connect(Socket.java:507)
        at java.net.Socket.connect(Socket.java:457)
        at sun.net.NetworkClient.doConnect(NetworkClient.java:157)
        at sun.net.www.http.HttpClient.openServer(HttpClient.java:365)
        at sun.net.www.http.HttpClient.openServer(HttpClient.java:477)
        at sun.net.www.http.HttpClient.<init>(HttpClient.java:214)
        at sun.net.www.http.HttpClient.New(HttpClient.java:287)
        at sun.net.www.http.HttpClient.New(HttpClient.java:299)
        at sun.net.www.protocol.http.HttpURLConnection.getNewHttpClient(HttpURLC
onnection.java:792)
        at sun.net.www.protocol.http.HttpURLConnection.plainConnect(HttpURLConne
ction.java:744)
        at sun.net.www.protocol.http.HttpURLConnection.connect(HttpURLConnection
.java:669)
        at sun.net.www.protocol.http.HttpURLConnection.getInputStream(HttpURLCon
nection.java:913)
        at com.sun.org.apache.xerces.internal.impl.XMLEntityManager.setupCurrent
Entity(XMLEntityManager.java:973)
        at com.sun.org.apache.xerces.internal.impl.XMLEntityManager.startEntity(
XMLEntityManager.java:905)
        at com.sun.org.apache.xerces.internal.impl.XMLEntityManager.startDTDEnti
ty(XMLEntityManager.java:872)
        at com.sun.org.apache.xerces.internal.impl.XMLDTDScannerImpl.setInputSou
rce(XMLDTDScannerImpl.java:282)
        at com.sun.org.apache.xerces.internal.impl.XMLDocumentScannerImpl$DTDDis
patcher.dispatch(XMLDocumentScannerImpl.java:1021)
        at com.sun.org.apache.xerces.internal.impl.XMLDocumentFragmentScannerImp
l.scanDocument(XMLDocumentFragmentScannerImpl.java:368)
        at com.sun.org.apache.xerces.internal.parsers.XML11Configuration.parse(X
ML11Configuration.java:834)
        at com.sun.org.apache.xerces.internal.parsers.XML11Configuration.parse(X
ML11Configuration.java:764)
        at com.sun.org.apache.xerces.internal.parsers.XMLParser.parse(XMLParser.
java:148)
        at com.sun.org.apache.xerces.internal.parsers.AbstractSAXParser.parse(Ab
stractSAXParser.java:1242)
        at org.apache.commons.digester.Digester.parse(Digester.java:1591)
        at org.apache.struts.config.TestModuleConfig.parseConfig(TestModuleConfi
g.java:97)
        at org.apache.struts.config.TestModuleConfig.testParseBase(TestModuleCon
fig.java:122)
        at org.apache.struts.config.TestModuleConfig.testParse1_1(TestModuleConf
ig.java:115)
        at sun.reflect.NativeMethodAccessorImpl.invoke0(Native Method)
        at sun.reflect.NativeMethodAccessorImpl.invoke(NativeMethodAccessorImpl.
java:39)
        at sun.reflect.DelegatingMethodAccessorImpl.invoke(DelegatingMethodAcces
sorImpl.java:25)
        at java.lang.reflect.Method.invoke(Method.java:585)
        at junit.framework.TestCase.runTest(TestCase.java:154)
        at junit.framework.TestCase.runBare(TestCase.java:127)
        at junit.framework.TestResult$1.protect(TestResult.java:106)
        at junit.framework.TestResult.runProtected(TestResult.java:124)
        at junit.framework.TestResult.run(TestResult.java:109)
        at junit.framework.TestCase.run(TestCase.java:118)
        at junit.framework.TestSuite.runTest(TestSuite.java:208)
        at junit.framework.TestSuite.run(TestSuite.java:203)
        at sun.reflect.GeneratedMethodAccessor44.invoke(Unknown Source)
        at sun.reflect.DelegatingMethodAccessorImpl.invoke(DelegatingMethodAcces
sorImpl.java:25)
        at java.lang.reflect.Method.invoke(Method.java:585)
        at org.apache.maven.surefire.battery.JUnitBattery.executeJUnit(JUnitBatt
ery.java:242)
        at org.apache.maven.surefire.battery.JUnitBattery.execute(JUnitBattery.j
ava:216)
        at org.apache.maven.surefire.Surefire.executeBattery(Surefire.java:215)
        at org.apache.maven.surefire.Surefire.run(Surefire.java:163)
        at org.apache.maven.surefire.Surefire.run(Surefire.java:87)
        at sun.reflect.NativeMethodAccessorImpl.invoke0(Native Method)
        at sun.reflect.NativeMethodAccessorImpl.invoke(NativeMethodAccessorImpl.
java:39)
        at sun.reflect.DelegatingMethodAccessorImpl.invoke(DelegatingMethodAcces
sorImpl.java:25)
        at java.lang.reflect.Method.invoke(Method.java:585)
        at org.apache.maven.surefire.SurefireBooter.runTestsInProcess(SurefireBo
oter.java:313)
        at org.apache.maven.surefire.SurefireBooter.run(SurefireBooter.java:221)

        at org.apache.maven.test.SurefirePlugin.execute(SurefirePlugin.java:371)

        at org.apache.maven.plugin.DefaultPluginManager.executeMojo(DefaultPlugi
nManager.java:412)
        at org.apache.maven.lifecycle.DefaultLifecycleExecutor.executeGoals(Defa
ultLifecycleExecutor.java:534)
        at org.apache.maven.lifecycle.DefaultLifecycleExecutor.executeGoalWithLi
fecycle(DefaultLifecycleExecutor.java:475)
        at org.apache.maven.lifecycle.DefaultLifecycleExecutor.executeGoal(Defau
ltLifecycleExecutor.java:454)
        at org.apache.maven.lifecycle.DefaultLifecycleExecutor.executeGoalAndHan
dleFailures(DefaultLifecycleExecutor.java:306)
        at org.apache.maven.lifecycle.DefaultLifecycleExecutor.executeTaskSegmen
ts(DefaultLifecycleExecutor.java:273)
        at org.apache.maven.lifecycle.DefaultLifecycleExecutor.execute(DefaultLi
fecycleExecutor.java:140)
        at org.apache.maven.DefaultMaven.doExecute(DefaultMaven.java:322)
        at org.apache.maven.DefaultMaven.execute(DefaultMaven.java:115)
        at org.apache.maven.cli.MavenCli.main(MavenCli.java:256)
        at sun.reflect.NativeMethodAccessorImpl.invoke0(Native Method)
        at sun.reflect.NativeMethodAccessorImpl.invoke(NativeMethodAccessorImpl.
java:39)
        at sun.reflect.DelegatingMethodAccessorImpl.invoke(DelegatingMethodAcces
sorImpl.java:25)
        at java.lang.reflect.Method.invoke(Method.java:585)
        at org.codehaus.classworlds.Launcher.launchEnhanced(Launcher.java:315)
        at org.codehaus.classworlds.Launcher.launch(Launcher.java:255)
        at org.codehaus.classworlds.Launcher.mainWithExitCode(Launcher.java:430)

        at org.codehaus.classworlds.Launcher.main(Launcher.java:375)
[surefire] Tests run: 5, Failures: 1, Errors: 0, Time elapsed: 100.781 sec <<<<<
<<< FAILURE !!
[surefire] Running org.apache.struts.util.TestRequestUtils
[surefire] Tests run: 22, Failures: 0, Errors: 0, Time elapsed: 0.031 sec
[surefire] Running org.apache.struts.util.TestRequestUtilsPopulate
[surefire] Tests run: 2, Failures: 0, Errors: 0, Time elapsed: 0.016 sec
[surefire] Running org.apache.struts.validator.TestValidWhen
[surefire] Tests run: 6, Failures: 0, Errors: 0, Time elapsed: 0.078 sec
[INFO] ------------------------------------------------------------------------
[ERROR] BUILD ERROR
[INFO] ------------------------------------------------------------------------
[INFO] There are test failures.
[INFO] ------------------------------------------------------------------------
[INFO] For more information, run Maven with the -e switch
[INFO] ------------------------------------------------------------------------
[INFO] Total time: 2 minutes 54 seconds
[INFO] Finished at: Fri Apr 28 23:07:49 GMT-07:00 2006
[INFO] Final Memory: 15M/42M
[INFO] ------------------------------------------------------------------------

April 5, 2006

List of Maven 1 Plugins currently in use:

~/java/maven-1.0.2/plugins
$ ls
cactus-maven-1.7.jar                       maven-jbuilder-plugin-1.5.jar
maven-abbot-plugin-1.1.jar                 maven-jcoverage-plugin-1.0.9.jar
maven-announcement-plugin-1.3.jar          maven-jdee-plugin-1.1.jar
maven-ant-plugin-1.8.1.jar                 maven-jdepend-plugin-1.5.jar
maven-ant-plugin-1.9.jar                   maven-jdeveloper-plugin-1.4.jar
maven-antlr-plugin-1.2.1.jar               maven-jdiff-plugin-1.4.jar
maven-appserver-plugin-2.0.jar             maven-jellydoc-plugin-1.3.1.jar
maven-artifact-plugin-1.4.1.jar            maven-jetty-plugin-1.1.jar
maven-ashkelon-plugin-1.2.jar              maven-jira-plugin-1.1.2.jar
maven-aspectj-plugin-3.2.jar               maven-jnlp-plugin-1.4.1.jar
maven-aspectwerkz-plugin-1.2.jar           maven-junit-doclet-plugin-1.2.jar
maven-caller-plugin-1.1.jar                maven-junit-report-plugin-1.5.jar
maven-castor-plugin-1.2.jar                maven-jxr-plugin-1.4.2.jar
maven-changelog-plugin-1.7.1.jar           maven-latex-plugin-1.4.1.jar
maven-changes-plugin-1.5.1.jar             maven-latka-plugin-1.4.1.jar
maven-checkstyle-plugin-2.5.jar            maven-license-plugin-1.2.jar
maven-clean-plugin-1.3.jar                 maven-linkcheck-plugin-1.3.4.jar
maven-clover-plugin-1.6.jar                maven-multichanges-plugin-1.1.jar
maven-console-plugin-1.1.jar               maven-multiproject-plugin-1.3.1.jar
maven-cruisecontrol-plugin-1.6.jar         maven-native-plugin-1.1.jar
maven-dashboard-plugin-1.6.jar             maven-nsis-plugin-1.1.jar
maven-developer-activity-plugin-1.5.1.jar  maven-pdf-plugin-2.4.jar
maven-dist-plugin-1.6.1.jar                maven-plugin-plugin-1.5.2.jar
maven-docbook-plugin-1.2.jar               maven-pmd-plugin-1.6.jar
maven-ear-plugin-1.6.jar                   maven-pom-plugin-1.4.1.jar
maven-eclipse-plugin-1.9.jar               maven-rar-plugin-1.0.jar
maven-ejb-plugin-1.5.jar                   maven-release-plugin-1.4.1.jar
maven-faq-plugin-1.4.jar                   maven-repository-plugin-1.2.jar
maven-file-activity-plugin-1.5.1.jar       maven-scm-plugin-1.4.1.jar
maven-findbugs-plugin-0.8.4.jar            maven-shell-plugin-1.1.jar
maven-genapp-plugin-2.2.jar                maven-simian-plugin-1.4.jar
maven-gump-plugin-1.4.jar                  maven-site-plugin-1.5.2.jar
maven-hibernate-plugin-1.2.jar             maven-struts-plugin-1.3.jar
maven-html2xdoc-plugin-1.3.1.jar           maven-tasklist-plugin-2.3.jar
maven-idea-plugin-1.6.jar                  maven-test-plugin-1.6.2.jar
maven-j2ee-plugin-1.5.1.jar                maven-tjdo-plugin-1.0.0.jar
maven-jalopy-plugin-1.3.1.jar              maven-uberjar-plugin-1.2.jar
maven-jar-plugin-1.6.1.jar                 maven-vdoclet-plugin-1.2.jar
maven-java-plugin-1.5.jar                  maven-war-plugin-1.6.1.jar
maven-javacc-plugin-1.1.jar                maven-webserver-plugin-2.0.jar
maven-javadoc-plugin-1.7.jar               maven-wizard-plugin-1.1.jar
maven-jboss-plugin-1.5.jar                 maven-xdoc-plugin-1.10-SNAPSHOT.jar

HomePage | RecentChanges | Preferences
This page is read-only | View other revisions
Last edited April 28, 2006 11:24 pm by WendySmoak (diff)
Search: