XWorkBuild

HomePage | RecentChanges | Preferences

2007-01-23

Trouble building XWork's Javadoc jar...

$ svn info
Path: .
URL: http://svn.opensymphony.com/svn/xwork/trunk
Repository Root: http://svn.opensymphony.com/svn/xwork
Repository UUID: e221344d-f017-0410-9bd5-d282ab1896d7
Revision: 1292
Node Kind: directory
Schedule: normal
Last Changed Author: mrdon
Last Changed Rev: 1292
Last Changed Date: 2007-01-03 01:17:32 -0700 (Wed, 03 Jan 2007)

[INFO] Scanning for projects...
[INFO] ----------------------------------------------------------------------------
[INFO] Building XWork
[INFO]    task-segment: [install]
[INFO] ----------------------------------------------------------------------------
[INFO] [resources:resources]
[INFO] Using default encoding to copy filtered resources.
[INFO] [compiler:compile]
Compiling 240 source files to e:\svn\opensymphony\xwork\target\classes
[INFO] [resources:testResources]
[INFO] Using default encoding to copy filtered resources.
[INFO] [compiler:testCompile]
Compiling 161 source files to e:\svn\opensymphony\xwork\target\test-classes
[INFO] [surefire:test]
[INFO] Surefire report directory: e:\svn\opensymphony\xwork\target\surefire-reports

-------------------------------------------------------
 T E S T S
-------------------------------------------------------
Running com.opensymphony.xwork2.util.XWorkListTest
Tests run: 0, Failures: 0, Errors: 0, Skipped: 0, Time elapsed: 0.046 sec
Running com.opensymphony.xwork2.validator.validators.ValidatorSupportTest
Jan 3, 2007 1:47:59 PM com.opensymphony.xwork2.util.ObjectTypeDeterminerFactory <clinit>
INFO: Detected GenericsObjectTypeDeterminer, initializing it...
Jan 3, 2007 1:47:59 PM com.opensymphony.xwork2.util.XWorkConverter getInstance
INFO: Detected AnnotationXWorkConverter, initializing it...
Tests run: 1, Failures: 0, Errors: 0, Skipped: 0, Time elapsed: 0.797 sec
Running com.opensymphony.xwork2.util.SetPropertiesTest
Tests run: 0, Failures: 0, Errors: 0, Skipped: 0, Time elapsed: 0.015 sec
Running com.opensymphony.xwork2.validator.RepopulateConversionErrorFieldValidatorSupportTest
Tests run: 3, Failures: 0, Errors: 0, Skipped: 0, Time elapsed: 0.188 sec
Running com.opensymphony.xwork2.config.entities.PackageConfigTest
Tests run: 0, Failures: 0, Errors: 0, Skipped: 0, Time elapsed: 0.015 sec
Running com.opensymphony.xwork2.config.impl.ActionConfigMatcherTest
Tests run: 0, Failures: 0, Errors: 0, Skipped: 0, Time elapsed: 0 sec
Running com.opensymphony.xwork2.LocaleAwareTest
Tests run: 0, Failures: 0, Errors: 0, Skipped: 0, Time elapsed: 0.016 sec
Running com.opensymphony.xwork2.DefaultTextProviderTest
Tests run: 7, Failures: 0, Errors: 0, Skipped: 0, Time elapsed: 0.171 sec
Running com.opensymphony.xwork2.validator.StringValidatorTest
Tests run: 0, Failures: 0, Errors: 0, Skipped: 0, Time elapsed: 0 sec
Running com.opensymphony.xwork2.util.LocalizedTextUtilTest
Tests run: 0, Failures: 0, Errors: 0, Skipped: 0, Time elapsed: 0.016 sec
Running com.opensymphony.xwork2.util.ClassLoaderUtilTest
Tests run: 6, Failures: 0, Errors: 0, Skipped: 0, Time elapsed: 0.188 sec
Running com.opensymphony.xwork2.interceptor.PrepareInterceptorTest
Tests run: 4, Failures: 0, Errors: 0, Skipped: 0, Time elapsed: 0.187 sec
Running com.opensymphony.xwork2.validator.RegexFieldValidatorTest
Tests run: 4, Failures: 0, Errors: 0, Skipped: 0, Time elapsed: 0.047 sec
Running com.opensymphony.xwork2.interceptor.ChainingInterceptorTest
Jan 3, 2007 1:48:00 PM com.opensymphony.xwork2.interceptor.ChainingInterceptor intercept
WARNING: compound root element at index 3 is null
Jan 3, 2007 1:48:00 PM com.opensymphony.xwork2.interceptor.ChainingInterceptor intercept
WARNING: compound root element at index 4 is null
Tests run: 5, Failures: 0, Errors: 0, Skipped: 0, Time elapsed: 0.078 sec
Running com.opensymphony.xwork2.util.InstantiatingNullHandlerTest
Tests run: 1, Failures: 0, Errors: 0, Skipped: 0, Time elapsed: 0 sec
Running com.opensymphony.xwork2.TestNGXWorkTestCaseTest$RunTest
Tests run: 0, Failures: 0, Errors: 0, Skipped: 0, Time elapsed: 0.015 sec
Running com.opensymphony.xwork2.util.profiling.UtilTimerStackTest
Jan 3, 2007 1:48:00 PM com.opensymphony.xwork2.util.profiling.UtilTimerStack printTimes
INFO: [0ms] - p1

Jan 3, 2007 1:48:01 PM com.opensymphony.xwork2.util.profiling.UtilTimerStack printTimes
INFO: [1047ms] - p1

Jan 3, 2007 1:48:02 PM com.opensymphony.xwork2.util.profiling.UtilTimerStack printTimes
INFO: [1047ms] - p1

Tests run: 4, Failures: 0, Errors: 0, Skipped: 0, Time elapsed: 2.125 sec
Running com.opensymphony.xwork2.interceptor.annotations.AnnotationWorkflowInterceptorTest
Tests run: 0, Failures: 0, Errors: 0, Skipped: 0, Time elapsed: 0.016 sec
Running com.opensymphony.xwork2.interceptor.StaticParametersInterceptorTest
Tests run: 0, Failures: 0, Errors: 0, Skipped: 0, Time elapsed: 0 sec
Running com.opensymphony.xwork2.config.providers.XmlConfigurationProviderPackagesTest
Tests run: 0, Failures: 0, Errors: 0, Skipped: 0, Time elapsed: 0.047 sec
Running com.opensymphony.xwork2.test.annotations.PersonActionTest
Tests run: 0, Failures: 0, Errors: 0, Skipped: 0, Time elapsed: 0.032 sec
Running com.opensymphony.xwork2.config.providers.XmlConfigurationProviderGlobalResultInheritenceTest
Tests run: 0, Failures: 0, Errors: 0, Skipped: 0, Time elapsed: 0 sec
Running com.opensymphony.xwork2.ActionInvocationTest
Tests run: 0, Failures: 0, Errors: 0, Skipped: 0, Time elapsed: 0.015 sec
Running com.opensymphony.xwork2.interceptor.I18nInterceptorTest
Tests run: 10, Failures: 0, Errors: 0, Skipped: 0, Time elapsed: 0.016 sec
Running com.opensymphony.xwork2.util.XWorkConverterTest
Tests run: 0, Failures: 0, Errors: 0, Skipped: 0, Time elapsed: 0.016 sec
Running com.opensymphony.xwork2.config.providers.XmlConfigurationProviderInvalidFileTest
Tests run: 0, Failures: 0, Errors: 0, Skipped: 0, Time elapsed: 0.015 sec
Running com.opensymphony.xwork2.TestNGXWorkTestCaseTest

===============================================
Command line suite
Total tests run: 1, Failures: 0, Skips: 0
===============================================

Tests run: 1, Failures: 0, Errors: 0, Skipped: 0, Time elapsed: 2.531 sec
Running com.opensymphony.xwork2.spring.SpringObjectFactoryTest
Tests run: 0, Failures: 0, Errors: 0, Skipped: 0, Time elapsed: 0.016 sec
Running com.opensymphony.xwork2.validator.StringLengthFieldValidatorTest
Jan 3, 2007 1:48:05 PM com.opensymphony.xwork2.util.XWorkConverter getInstance
INFO: Detected AnnotationXWorkConverter, initializing it...
Tests run: 9, Failures: 0, Errors: 0, Skipped: 0, Time elapsed: 0.078 sec
Running com.opensymphony.xwork2.validator.ExpressionValidatorTest
Tests run: 0, Failures: 0, Errors: 0, Skipped: 0, Time elapsed: 0 sec
Running com.opensymphony.xwork2.config.providers.XmlConfigurationProviderTest
Tests run: 0, Failures: 0, Errors: 0, Skipped: 0, Time elapsed: 0.016 sec
Running com.opensymphony.xwork2.util.XWorkMapTest
Tests run: 0, Failures: 0, Errors: 0, Skipped: 0, Time elapsed: 0.015 sec
Running com.opensymphony.xwork2.ActionContextThreadLocalTest
Tests run: 2, Failures: 0, Errors: 0, Skipped: 0, Time elapsed: 0.032 sec
Running com.opensymphony.xwork2.ChainResultTest
Tests run: 0, Failures: 0, Errors: 0, Skipped: 0, Time elapsed: 0.015 sec
Running com.opensymphony.xwork2.validator.VisitorFieldValidatorTest
Jan 3, 2007 1:48:05 PM com.opensymphony.xwork2.validator.ActionValidatorManagerFactory <clinit>
INFO: Detected AnnotationActionValidatorManager, initializing it...
Tests run: 5, Failures: 0, Errors: 0, Skipped: 0, Time elapsed: 0.859 sec
Running com.opensymphony.xwork2.validator.VisitorFieldValidatorModelTest
Tests run: 2, Failures: 0, Errors: 0, Skipped: 0, Time elapsed: 0.11 sec
Running com.opensymphony.xwork2.validator.ValidatorFileParserTest
Tests run: 0, Failures: 0, Errors: 0, Skipped: 0, Time elapsed: 0.015 sec
Running com.opensymphony.xwork2.util.OgnlValueStackTest
Tests run: 0, Failures: 0, Errors: 0, Skipped: 0, Time elapsed: 0 sec
Running com.opensymphony.xwork2.config.providers.XmlConfigurationProviderInterceptorParamOverridingTest
Jan 3, 2007 1:48:06 PM com.opensymphony.xwork2.config.providers.XmlConfigurationProvider register
INFO: Parsing configuration file [com/opensymphony/xwork2/config/providers/xwork-test-interceptor-param-overriding.xml]
Jan 3, 2007 1:48:06 PM com.opensymphony.xwork2.config.providers.XmlConfigurationProvider buildResults
WARNING: no default parameter defined for result of type mock
Jan 3, 2007 1:48:06 PM com.opensymphony.xwork2.config.providers.XmlConfigurationProvider buildResults
WARNING: no default parameter defined for result of type mock
Tests run: 1, Failures: 0, Errors: 0, Skipped: 0, Time elapsed: 0.157 sec
Running com.opensymphony.xwork2.validator.ModelDrivenValidationTest
Tests run: 0, Failures: 0, Errors: 0, Skipped: 0, Time elapsed: 0 sec
Running com.opensymphony.xwork2.validator.DefaultActionValidatorManagerTest
Tests run: 0, Failures: 0, Errors: 0, Skipped: 0, Time elapsed: 0 sec
Running com.opensymphony.xwork2.validator.ConversionErrorFieldValidatorTest
Tests run: 2, Failures: 0, Errors: 0, Skipped: 0, Time elapsed: 0.031 sec
Running com.opensymphony.xwork2.validator.EmailValidatorTest
Tests run: 0, Failures: 0, Errors: 0, Skipped: 0, Time elapsed: 0.016 sec
Running com.opensymphony.xwork2.interceptor.ModelDrivenInterceptorTest
Tests run: 2, Failures: 0, Errors: 0, Skipped: 0, Time elapsed: 0.016 sec
Running com.opensymphony.xwork2.interceptor.ConversionErrorInterceptorTest
Tests run: 0, Failures: 0, Errors: 0, Skipped: 0, Time elapsed: 0.031 sec
Running com.opensymphony.xwork2.interceptor.ParameterFilterInterceptorTest
Tests run: 7, Failures: 0, Errors: 0, Skipped: 0, Time elapsed: 0.031 sec
Running com.opensymphony.xwork2.validator.URLValidatorTest
Tests run: 5, Failures: 0, Errors: 0, Skipped: 0, Time elapsed: 0.063 sec
Running com.opensymphony.xwork2.spring.interceptor.ActionAutowiringInterceptorTest
Tests run: 0, Failures: 0, Errors: 0, Skipped: 0, Time elapsed: 0.015 sec
Running com.opensymphony.xwork2.interceptor.TimerInterceptorTest
Tests run: 0, Failures: 0, Errors: 0, Skipped: 0, Time elapsed: 0.016 sec
Running com.opensymphony.xwork2.config.providers.XmlConfigurationProviderInterceptorsTest
Tests run: 0, Failures: 0, Errors: 0, Skipped: 0, Time elapsed: 0.016 sec
Running com.opensymphony.xwork2.config.providers.XmlConfigurationProviderResultsTest
Tests run: 0, Failures: 0, Errors: 0, Skipped: 0, Time elapsed: 0 sec
Running com.opensymphony.xwork2.interceptor.DefaultWorkflowInterceptorPrefixMethodInvocationTest
Tests run: 2, Failures: 0, Errors: 0, Skipped: 0, Time elapsed: 0.031 sec
Running com.opensymphony.xwork2.WildCardResultTest
Tests run: 0, Failures: 0, Errors: 0, Skipped: 0, Time elapsed: 0 sec
Running com.opensymphony.xwork2.interceptor.PreResultListenerTest
Tests run: 0, Failures: 0, Errors: 0, Skipped: 0, Time elapsed: 0.016 sec
Running com.opensymphony.xwork2.ActionContextTest
Tests run: 8, Failures: 0, Errors: 0, Skipped: 0, Time elapsed: 0.016 sec
Running com.opensymphony.xwork2.config.providers.XmlConfigurationProviderExceptionMappingsTest
Tests run: 0, Failures: 0, Errors: 0, Skipped: 0, Time elapsed: 0.078 sec
Running com.opensymphony.xwork2.config.providers.XmlConfigurationProviderInterceptorsSpringTest
Tests run: 0, Failures: 0, Errors: 0, Skipped: 0, Time elapsed: 0 sec
Running com.opensymphony.xwork2.config.ConfigurationTest
Tests run: 0, Failures: 0, Errors: 0, Skipped: 0, Time elapsed: 0.015 sec
Running com.opensymphony.xwork2.util.DomHelperTest
Tests run: 2, Failures: 0, Errors: 0, Skipped: 0, Time elapsed: 0.094 sec
Running com.opensymphony.xwork2.util.XWorkListPropertyAccessorTest
Tests run: 0, Failures: 0, Errors: 0, Skipped: 0, Time elapsed: 0.016 sec
Running com.opensymphony.xwork2.interceptor.ExceptionMappingInterceptorTest
Jan 3, 2007 1:48:07 PM com.opensymphony.xwork2.interceptor.ExceptionMappingInterceptor doLog
WARNING: test
java.lang.Exception: test
	at com.opensymphony.xwork2.interceptor.ExceptionMappingInterceptorTest.testThrownExceptionNoMatchLoggingCategoryLevelWarn(ExceptionMappingInterceptorTest.java:167)
	at sun.reflect.NativeMethodAccessorImpl.invoke0(Native Method)
	at sun.reflect.NativeMethodAccessorImpl.invoke(NativeMethodAccessorImpl.java:39)
	at sun.reflect.DelegatingMethodAccessorImpl.invoke(DelegatingMethodAccessorImpl.java:25)
	at java.lang.reflect.Method.invoke(Method.java:585)
	at org.testng.internal.MethodHelper.invokeMethod(MethodHelper.java:552)
	at org.testng.internal.Invoker.invokeMethod(Invoker.java:411)
	at org.testng.internal.Invoker.invokeTestMethods(Invoker.java:785)
	at org.testng.internal.TestMethodWorker.run(TestMethodWorker.java:114)
	at org.testng.TestRunner.privateRun(TestRunner.java:693)
	at org.testng.TestRunner.run(TestRunner.java:574)
	at org.testng.SuiteRunner.privateRun(SuiteRunner.java:241)
	at org.testng.SuiteRunner.run(SuiteRunner.java:145)
	at org.testng.TestNG.createAndRunSuiteRunners(TestNG.java:901)
	at org.testng.TestNG.runSuitesLocally(TestNG.java:863)
	at org.apache.maven.surefire.testng.TestNGDirectoryTestSuite.executeTestNG(TestNGDirectoryTestSuite.java:191)
	at org.apache.maven.surefire.testng.TestNGDirectoryTestSuite.execute(TestNGDirectoryTestSuite.java:145)
	at org.apache.maven.surefire.Surefire.run(Surefire.java:129)
	at sun.reflect.NativeMethodAccessorImpl.invoke0(Native Method)
	at sun.reflect.NativeMethodAccessorImpl.invoke(NativeMethodAccessorImpl.java:39)
	at sun.reflect.DelegatingMethodAccessorImpl.invoke(DelegatingMethodAccessorImpl.java:25)
	at java.lang.reflect.Method.invoke(Method.java:585)
	at org.apache.maven.surefire.booter.SurefireBooter.runSuitesInProcess(SurefireBooter.java:225)
	at org.apache.maven.surefire.booter.SurefireBooter.main(SurefireBooter.java:747)
Jan 3, 2007 1:48:07 PM com.opensymphony.xwork2.interceptor.ExceptionMappingInterceptor doLog
INFO: test
java.lang.Exception: test
	at com.opensymphony.xwork2.interceptor.ExceptionMappingInterceptorTest.testThrownExceptionNoMatchLoggingCategoryLevelInfo(ExceptionMappingInterceptorTest.java:186)
	at sun.reflect.NativeMethodAccessorImpl.invoke0(Native Method)
	at sun.reflect.NativeMethodAccessorImpl.invoke(NativeMethodAccessorImpl.java:39)
	at sun.reflect.DelegatingMethodAccessorImpl.invoke(DelegatingMethodAccessorImpl.java:25)
	at java.lang.reflect.Method.invoke(Method.java:585)
	at org.testng.internal.MethodHelper.invokeMethod(MethodHelper.java:552)
	at org.testng.internal.Invoker.invokeMethod(Invoker.java:411)
	at org.testng.internal.Invoker.invokeTestMethods(Invoker.java:785)
	at org.testng.internal.TestMethodWorker.run(TestMethodWorker.java:114)
	at org.testng.TestRunner.privateRun(TestRunner.java:693)
	at org.testng.TestRunner.run(TestRunner.java:574)
	at org.testng.SuiteRunner.privateRun(SuiteRunner.java:241)
	at org.testng.SuiteRunner.run(SuiteRunner.java:145)
	at org.testng.TestNG.createAndRunSuiteRunners(TestNG.java:901)
	at org.testng.TestNG.runSuitesLocally(TestNG.java:863)
	at org.apache.maven.surefire.testng.TestNGDirectoryTestSuite.executeTestNG(TestNGDirectoryTestSuite.java:191)
	at org.apache.maven.surefire.testng.TestNGDirectoryTestSuite.execute(TestNGDirectoryTestSuite.java:145)
	at org.apache.maven.surefire.Surefire.run(Surefire.java:129)
	at sun.reflect.NativeMethodAccessorImpl.invoke0(Native Method)
	at sun.reflect.NativeMethodAccessorImpl.invoke(NativeMethodAccessorImpl.java:39)
	at sun.reflect.DelegatingMethodAccessorImpl.invoke(DelegatingMethodAccessorImpl.java:25)
	at java.lang.reflect.Method.invoke(Method.java:585)
	at org.apache.maven.surefire.booter.SurefireBooter.runSuitesInProcess(SurefireBooter.java:225)
	at org.apache.maven.surefire.booter.SurefireBooter.main(SurefireBooter.java:747)
Jan 3, 2007 1:48:07 PM com.opensymphony.xwork2.interceptor.ExceptionMappingInterceptor doLog
SEVERE: test
java.lang.Exception: test
	at com.opensymphony.xwork2.interceptor.ExceptionMappingInterceptorTest.testThrownExceptionNoMatchLoggingCategoryLevelError(ExceptionMappingInterceptorTest.java:148)
	at sun.reflect.NativeMethodAccessorImpl.invoke0(Native Method)
	at sun.reflect.NativeMethodAccessorImpl.invoke(NativeMethodAccessorImpl.java:39)
	at sun.reflect.DelegatingMethodAccessorImpl.invoke(DelegatingMethodAccessorImpl.java:25)
	at java.lang.reflect.Method.invoke(Method.java:585)
	at org.testng.internal.MethodHelper.invokeMethod(MethodHelper.java:552)
	at org.testng.internal.Invoker.invokeMethod(Invoker.java:411)
	at org.testng.internal.Invoker.invokeTestMethods(Invoker.java:785)
	at org.testng.internal.TestMethodWorker.run(TestMethodWorker.java:114)
	at org.testng.TestRunner.privateRun(TestRunner.java:693)
	at org.testng.TestRunner.run(TestRunner.java:574)
	at org.testng.SuiteRunner.privateRun(SuiteRunner.java:241)
	at org.testng.SuiteRunner.run(SuiteRunner.java:145)
	at org.testng.TestNG.createAndRunSuiteRunners(TestNG.java:901)
	at org.testng.TestNG.runSuitesLocally(TestNG.java:863)
	at org.apache.maven.surefire.testng.TestNGDirectoryTestSuite.executeTestNG(TestNGDirectoryTestSuite.java:191)
	at org.apache.maven.surefire.testng.TestNGDirectoryTestSuite.execute(TestNGDirectoryTestSuite.java:145)
	at org.apache.maven.surefire.Surefire.run(Surefire.java:129)
	at sun.reflect.NativeMethodAccessorImpl.invoke0(Native Method)
	at sun.reflect.NativeMethodAccessorImpl.invoke(NativeMethodAccessorImpl.java:39)
	at sun.reflect.DelegatingMethodAccessorImpl.invoke(DelegatingMethodAccessorImpl.java:25)
	at java.lang.reflect.Method.invoke(Method.java:585)
	at org.apache.maven.surefire.booter.SurefireBooter.runSuitesInProcess(SurefireBooter.java:225)
	at org.apache.maven.surefire.booter.SurefireBooter.main(SurefireBooter.java:747)
Jan 3, 2007 1:48:07 PM com.opensymphony.xwork2.interceptor.ExceptionMappingInterceptor doLog
SEVERE: test
java.lang.Exception: test
	at com.opensymphony.xwork2.interceptor.ExceptionMappingInterceptorTest.testThrownExceptionNoMatchLoggingCategoryLevelFatal(ExceptionMappingInterceptorTest.java:125)
	at sun.reflect.NativeMethodAccessorImpl.invoke0(Native Method)
	at sun.reflect.NativeMethodAccessorImpl.invoke(NativeMethodAccessorImpl.java:39)
	at sun.reflect.DelegatingMethodAccessorImpl.invoke(DelegatingMethodAccessorImpl.java:25)
	at java.lang.reflect.Method.invoke(Method.java:585)
	at org.testng.internal.MethodHelper.invokeMethod(MethodHelper.java:552)
	at org.testng.internal.Invoker.invokeMethod(Invoker.java:411)
	at org.testng.internal.Invoker.invokeTestMethods(Invoker.java:785)
	at org.testng.internal.TestMethodWorker.run(TestMethodWorker.java:114)
	at org.testng.TestRunner.privateRun(TestRunner.java:693)
	at org.testng.TestRunner.run(TestRunner.java:574)
	at org.testng.SuiteRunner.privateRun(SuiteRunner.java:241)
	at org.testng.SuiteRunner.run(SuiteRunner.java:145)
	at org.testng.TestNG.createAndRunSuiteRunners(TestNG.java:901)
	at org.testng.TestNG.runSuitesLocally(TestNG.java:863)
	at org.apache.maven.surefire.testng.TestNGDirectoryTestSuite.executeTestNG(TestNGDirectoryTestSuite.java:191)
	at org.apache.maven.surefire.testng.TestNGDirectoryTestSuite.execute(TestNGDirectoryTestSuite.java:145)
	at org.apache.maven.surefire.Surefire.run(Surefire.java:129)
	at sun.reflect.NativeMethodAccessorImpl.invoke0(Native Method)
	at sun.reflect.NativeMethodAccessorImpl.invoke(NativeMethodAccessorImpl.java:39)
	at sun.reflect.DelegatingMethodAccessorImpl.invoke(DelegatingMethodAccessorImpl.java:25)
	at java.lang.reflect.Method.invoke(Method.java:585)
	at org.apache.maven.surefire.booter.SurefireBooter.runSuitesInProcess(SurefireBooter.java:225)
	at org.apache.maven.surefire.booter.SurefireBooter.main(SurefireBooter.java:747)
Tests run: 13, Failures: 0, Errors: 0, Skipped: 0, Time elapsed: 0.047 sec
Running com.opensymphony.xwork2.util.MyBeanActionTest
Tests run: 0, Failures: 0, Errors: 0, Skipped: 0, Time elapsed: 0.015 sec
Running com.opensymphony.xwork2.util.XWorkBasicConverterTest
Tests run: 3, Failures: 0, Errors: 0, Skipped: 0, Time elapsed: 0.016 sec
Running com.opensymphony.xwork2.ActionSupportTest
Jan 3, 2007 1:48:07 PM com.opensymphony.xwork2.util.LocalizedTextUtil findText
WARNING: Trying to find text with null key!
Jan 3, 2007 1:48:07 PM com.opensymphony.xwork2.util.LocalizedTextUtil findText
WARNING: Trying to find text with null key!
Jan 3, 2007 1:48:07 PM com.opensymphony.xwork2.util.LocalizedTextUtil findText
WARNING: Trying to find text with null key!
Jan 3, 2007 1:48:07 PM com.opensymphony.xwork2.util.LocalizedTextUtil findText
WARNING: Trying to find text with null key!
Jan 3, 2007 1:48:07 PM com.opensymphony.xwork2.util.LocalizedTextUtil findText
WARNING: Trying to find text with null key!
Jan 3, 2007 1:48:07 PM com.opensymphony.xwork2.util.LocalizedTextUtil findText
WARNING: Trying to find text with null key!
Jan 3, 2007 1:48:07 PM com.opensymphony.xwork2.util.LocalizedTextUtil findText
WARNING: Trying to find text with null key!
Jan 3, 2007 1:48:07 PM com.opensymphony.xwork2.util.LocalizedTextUtil findText
WARNING: Trying to find text with null key!
Jan 3, 2007 1:48:07 PM com.opensymphony.xwork2.util.LocalizedTextUtil findText
WARNING: Trying to find text with null key!
Tests run: 14, Failures: 0, Errors: 0, Skipped: 0, Time elapsed: 0.062 sec
Running com.opensymphony.xwork2.ActionNestingTest
Tests run: 0, Failures: 0, Errors: 0, Skipped: 0, Time elapsed: 0.016 sec
Running com.opensymphony.xwork2.config.providers.XmlConfigurationProviderResultTypesTest
Tests run: 0, Failures: 0, Errors: 0, Skipped: 0, Time elapsed: 0.015 sec
Running com.opensymphony.xwork2.util.location.LocationAttributesTest
Tests run: 3, Failures: 0, Errors: 0, Skipped: 0, Time elapsed: 0.047 sec
Running com.opensymphony.xwork2.spring.ActionsFromSpringTest
Tests run: 0, Failures: 0, Errors: 0, Skipped: 0, Time elapsed: 0.016 sec
Running com.opensymphony.xwork2.util.GetPropertiesTest
Tests run: 1, Failures: 0, Errors: 0, Skipped: 0, Time elapsed: 0.047 sec
Running com.opensymphony.xwork2.interceptor.AliasInterceptorTest
Tests run: 0, Failures: 0, Errors: 0, Skipped: 0, Time elapsed: 0 sec
Running com.opensymphony.xwork2.validator.AnnotationActionValidatorManagerTest
Tests run: 0, Failures: 0, Errors: 0, Skipped: 0, Time elapsed: 0.016 sec
Running com.opensymphony.xwork2.util.TextParseUtilTest
Tests run: 0, Failures: 0, Errors: 0, Skipped: 0, Time elapsed: 0.015 sec
Running com.opensymphony.xwork2.TextProviderSupportTest
Tests run: 0, Failures: 0, Errors: 0, Skipped: 0, Time elapsed: 0.016 sec
Running com.opensymphony.xwork2.config.entities.ActionConfigTest
Tests run: 0, Failures: 0, Errors: 0, Skipped: 0, Time elapsed: 0.015 sec
Running com.opensymphony.xwork2.config.providers.XmlConfigurationProviderMultilevelTest
Tests run: 0, Failures: 0, Errors: 0, Skipped: 0, Time elapsed: 0 sec
Running com.opensymphony.xwork2.interceptor.DefaultWorkflowInterceptor2Test
Jan 3, 2007 1:48:07 PM com.opensymphony.xwork2.interceptor.DefaultWorkflowInterceptor doIntercept
WARNING: an exception occured while executing the prefix method
java.lang.reflect.InvocationTargetException
	at sun.reflect.NativeMethodAccessorImpl.invoke0(Native Method)
	at sun.reflect.NativeMethodAccessorImpl.invoke(NativeMethodAccessorImpl.java:39)
	at sun.reflect.DelegatingMethodAccessorImpl.invoke(DelegatingMethodAccessorImpl.java:25)
	at java.lang.reflect.Method.invoke(Method.java:585)
	at com.opensymphony.xwork2.interceptor.PrefixMethodInvocationUtil.invokePrefixMethod(PrefixMethodInvocationUtil.java:111)
	at com.opensymphony.xwork2.interceptor.DefaultWorkflowInterceptor.doIntercept(DefaultWorkflowInterceptor.java:179)
	at com.opensymphony.xwork2.interceptor.MethodFilterInterceptor.intercept(MethodFilterInterceptor.java:86)
	at com.opensymphony.xwork2.interceptor.DefaultWorkflowInterceptor2Test.testValidateDoXXXThowsException(DefaultWorkflowInterceptor2Test.java:143)
	at sun.reflect.NativeMethodAccessorImpl.invoke0(Native Method)
	at sun.reflect.NativeMethodAccessorImpl.invoke(NativeMethodAccessorImpl.java:39)
	at sun.reflect.DelegatingMethodAccessorImpl.invoke(DelegatingMethodAccessorImpl.java:25)
	at java.lang.reflect.Method.invoke(Method.java:585)
	at org.testng.internal.MethodHelper.invokeMethod(MethodHelper.java:552)
	at org.testng.internal.Invoker.invokeMethod(Invoker.java:411)
	at org.testng.internal.Invoker.invokeTestMethods(Invoker.java:785)
	at org.testng.internal.TestMethodWorker.run(TestMethodWorker.java:114)
	at org.testng.TestRunner.privateRun(TestRunner.java:693)
	at org.testng.TestRunner.run(TestRunner.java:574)
	at org.testng.SuiteRunner.privateRun(SuiteRunner.java:241)
	at org.testng.SuiteRunner.run(SuiteRunner.java:145)
	at org.testng.TestNG.createAndRunSuiteRunners(TestNG.java:901)
	at org.testng.TestNG.runSuitesLocally(TestNG.java:863)
	at org.apache.maven.surefire.testng.TestNGDirectoryTestSuite.executeTestNG(TestNGDirectoryTestSuite.java:191)
	at org.apache.maven.surefire.testng.TestNGDirectoryTestSuite.execute(TestNGDirectoryTestSuite.java:145)
	at org.apache.maven.surefire.Surefire.run(Surefire.java:129)
	at sun.reflect.NativeMethodAccessorImpl.invoke0(Native Method)
	at sun.reflect.NativeMethodAccessorImpl.invoke(NativeMethodAccessorImpl.java:39)
	at sun.reflect.DelegatingMethodAccessorImpl.invoke(DelegatingMethodAccessorImpl.java:25)
	at java.lang.reflect.Method.invoke(Method.java:585)
	at org.apache.maven.surefire.booter.SurefireBooter.runSuitesInProcess(SurefireBooter.java:225)
	at org.apache.maven.surefire.booter.SurefireBooter.main(SurefireBooter.java:747)
Caused by: java.lang.Exception: testing
	at com.opensymphony.xwork2.interceptor.DefaultWorkflowInterceptor2Test$ValidateDoXXXAction.validateDoExecute(DefaultWorkflowInterceptor2Test.java:183)
	... 31 more
Jan 3, 2007 1:48:07 PM com.opensymphony.xwork2.interceptor.DefaultWorkflowInterceptor doIntercept
WARNING: an exception occured while executing the prefix method
java.lang.reflect.InvocationTargetException
	at sun.reflect.NativeMethodAccessorImpl.invoke0(Native Method)
	at sun.reflect.NativeMethodAccessorImpl.invoke(NativeMethodAccessorImpl.java:39)
	at sun.reflect.DelegatingMethodAccessorImpl.invoke(DelegatingMethodAccessorImpl.java:25)
	at java.lang.reflect.Method.invoke(Method.java:585)
	at com.opensymphony.xwork2.interceptor.PrefixMethodInvocationUtil.invokePrefixMethod(PrefixMethodInvocationUtil.java:111)
	at com.opensymphony.xwork2.interceptor.DefaultWorkflowInterceptor.doIntercept(DefaultWorkflowInterceptor.java:179)
	at com.opensymphony.xwork2.interceptor.MethodFilterInterceptor.intercept(MethodFilterInterceptor.java:86)
	at com.opensymphony.xwork2.interceptor.DefaultWorkflowInterceptor2Test.testValidateXXXThrowsException(DefaultWorkflowInterceptor2Test.java:107)
	at sun.reflect.NativeMethodAccessorImpl.invoke0(Native Method)
	at sun.reflect.NativeMethodAccessorImpl.invoke(NativeMethodAccessorImpl.java:39)
	at sun.reflect.DelegatingMethodAccessorImpl.invoke(DelegatingMethodAccessorImpl.java:25)
	at java.lang.reflect.Method.invoke(Method.java:585)
	at org.testng.internal.MethodHelper.invokeMethod(MethodHelper.java:552)
	at org.testng.internal.Invoker.invokeMethod(Invoker.java:411)
	at org.testng.internal.Invoker.invokeTestMethods(Invoker.java:785)
	at org.testng.internal.TestMethodWorker.run(TestMethodWorker.java:114)
	at org.testng.TestRunner.privateRun(TestRunner.java:693)
	at org.testng.TestRunner.run(TestRunner.java:574)
	at org.testng.SuiteRunner.privateRun(SuiteRunner.java:241)
	at org.testng.SuiteRunner.run(SuiteRunner.java:145)
	at org.testng.TestNG.createAndRunSuiteRunners(TestNG.java:901)
	at org.testng.TestNG.runSuitesLocally(TestNG.java:863)
	at org.apache.maven.surefire.testng.TestNGDirectoryTestSuite.executeTestNG(TestNGDirectoryTestSuite.java:191)
	at org.apache.maven.surefire.testng.TestNGDirectoryTestSuite.execute(TestNGDirectoryTestSuite.java:145)
	at org.apache.maven.surefire.Surefire.run(Surefire.java:129)
	at sun.reflect.NativeMethodAccessorImpl.invoke0(Native Method)
	at sun.reflect.NativeMethodAccessorImpl.invoke(NativeMethodAccessorImpl.java:39)
	at sun.reflect.DelegatingMethodAccessorImpl.invoke(DelegatingMethodAccessorImpl.java:25)
	at java.lang.reflect.Method.invoke(Method.java:585)
	at org.apache.maven.surefire.booter.SurefireBooter.runSuitesInProcess(SurefireBooter.java:225)
	at org.apache.maven.surefire.booter.SurefireBooter.main(SurefireBooter.java:747)
Caused by: java.lang.Exception: testing
	at com.opensymphony.xwork2.interceptor.DefaultWorkflowInterceptor2Test$ValidateXXXAction.validateExecute(DefaultWorkflowInterceptor2Test.java:172)
	... 31 more
Tests run: 4, Failures: 0, Errors: 0, Skipped: 0, Time elapsed: 0.047 sec
Running com.opensymphony.xwork2.interceptor.DefaultWorkflowInterceptorTest
Tests run: 12, Failures: 0, Errors: 0, Skipped: 0, Time elapsed: 0.047 sec
Running com.opensymphony.xwork2.interceptor.ParametersInterceptorTest
Tests run: 0, Failures: 0, Errors: 0, Skipped: 0, Time elapsed: 0 sec
Running com.opensymphony.xwork2.validator.IntRangeValidatorTest
Tests run: 0, Failures: 0, Errors: 0, Skipped: 0, Time elapsed: 0 sec
Running com.opensymphony.xwork2.util.profiling.ProfilingTimerBeanTest
Tests run: 3, Failures: 0, Errors: 0, Skipped: 0, Time elapsed: 2.125 sec
Running com.opensymphony.xwork2.config.ConfigurationManagerTest
Tests run: 0, Failures: 0, Errors: 0, Skipped: 0, Time elapsed: 0.016 sec
Running com.opensymphony.xwork2.util.AnnotationXWorkConverterTest
Tests run: 0, Failures: 0, Errors: 0, Skipped: 0, Time elapsed: 0.016 sec
Running com.opensymphony.xwork2.validator.DateRangeValidatorTest
Tests run: 0, Failures: 0, Errors: 0, Skipped: 0, Time elapsed: 0 sec
Running com.opensymphony.xwork2.validator.DoubleRangeValidatorTest
Tests run: 0, Failures: 0, Errors: 0, Skipped: 0, Time elapsed: 0 sec
Running com.opensymphony.xwork2.util.location.LocationImplTest
Tests run: 4, Failures: 0, Errors: 0, Skipped: 0, Time elapsed: 0.125 sec
Running com.opensymphony.xwork2.interceptor.ScopedModelDrivenInterceptorTest
Tests run: 0, Failures: 0, Errors: 0, Skipped: 0, Time elapsed: 0 sec
Running com.opensymphony.xwork2.util.OgnlUtilTest
Tests run: 0, Failures: 0, Errors: 0, Skipped: 0, Time elapsed: 0 sec
Running com.opensymphony.xwork2.util.location.LocationUtilsTest
Tests run: 3, Failures: 0, Errors: 0, Skipped: 0, Time elapsed: 0.031 sec
Running com.opensymphony.xwork2.validator.SimpleActionValidationTest
Tests run: 0, Failures: 0, Errors: 0, Skipped: 0, Time elapsed: 0.016 sec
Running com.opensymphony.xwork2.config.providers.XmlConfigurationProviderActionsTest
Tests run: 0, Failures: 0, Errors: 0, Skipped: 0, Time elapsed: 0.015 sec
Running com.opensymphony.xwork2.interceptor.PrefixMethodInvocationUtilTest
Tests run: 11, Failures: 0, Errors: 0, Skipped: 0, Time elapsed: 0.047 sec
Running com.opensymphony.xwork2.spring.InjectSpringObjectFactoryTest
Tests run: 0, Failures: 0, Errors: 0, Skipped: 0, Time elapsed: 0 sec

Results :
Tests run: 164, Failures: 0, Errors: 0, Skipped: 0

[INFO] [jar:jar]
[INFO] Building jar: e:\svn\opensymphony\xwork\target\xwork-2.0-SNAPSHOT.jar
[INFO] Preparing javadoc:jar
[WARNING] Removing: jar from forked lifecycle, to prevent recursive invocation.
[INFO] No goals needed for project - skipping
[INFO] [javadoc:jar {execution: attach-source}]
Loading source files for package ensymphony.xwork.src.java.com.opensymphony.xwork2...
Loading source files for package ensymphony.xwork.src.java.com.opensymphony.xwork2.config...
Loading source files for package ensymphony.xwork.src.java.com.opensymphony.xwork2.config.entities...
Loading source files for package ensymphony.xwork.src.java.com.opensymphony.xwork2.config.impl...
Loading source files for package ensymphony.xwork.src.java.com.opensymphony.xwork2.config.providers...
Loading source files for package ensymphony.xwork.src.java.com.opensymphony.xwork2.conversion.annotations...
Loading source files for package ensymphony.xwork.src.java.com.opensymphony.xwork2.conversion.metadata...
Loading source files for package ensymphony.xwork.src.java.com.opensymphony.xwork2.inject...
Loading source files for package ensymphony.xwork.src.java.com.opensymphony.xwork2.inject.util...
Loading source files for package ensymphony.xwork.src.java.com.opensymphony.xwork2.interceptor...
Loading source files for package ensymphony.xwork.src.java.com.opensymphony.xwork2.interceptor.annotations...
Loading source files for package ensymphony.xwork.src.java.com.opensymphony.xwork2.mock...
Loading source files for package ensymphony.xwork.src.java.com.opensymphony.xwork2.spring.interceptor...
Loading source files for package ensymphony.xwork.src.java.com.opensymphony.xwork2.spring...
Loading source files for package ensymphony.xwork.src.java.com.opensymphony.xwork2.util...
Loading source files for package ensymphony.xwork.src.java.com.opensymphony.xwork2.util.location...
Loading source files for package ensymphony.xwork.src.java.com.opensymphony.xwork2.util.profiling...
Loading source files for package ensymphony.xwork.src.java.com.opensymphony.xwork2.validator...
Loading source files for package ensymphony.xwork.src.java.com.opensymphony.xwork2.validator.annotations...
Loading source files for package ensymphony.xwork.src.java.com.opensymphony.xwork2.validator.metadata...
Loading source files for package ensymphony.xwork.src.java.com.opensymphony.xwork2.validator.validators...
Constructing Javadoc information...
1 error
42 warnings
[INFO] ------------------------------------------------------------------------
[ERROR] BUILD ERROR
[INFO] ------------------------------------------------------------------------
[INFO] Error while creating archive:Exit code: 1 - javadoc: warning - No source files for package ensymphony.xwork.src.java.com.opensymphony.xwork2
javadoc: warning - No source files for package ensymphony.xwork.src.java.com.opensymphony.xwork2.config
javadoc: warning - No source files for package ensymphony.xwork.src.java.com.opensymphony.xwork2.config.entities
javadoc: warning - No source files for package ensymphony.xwork.src.java.com.opensymphony.xwork2.config.impl
javadoc: warning - No source files for package ensymphony.xwork.src.java.com.opensymphony.xwork2.config.providers
javadoc: warning - No source files for package ensymphony.xwork.src.java.com.opensymphony.xwork2.conversion.annotations
javadoc: warning - No source files for package ensymphony.xwork.src.java.com.opensymphony.xwork2.conversion.metadata
javadoc: warning - No source files for package ensymphony.xwork.src.java.com.opensymphony.xwork2.inject
javadoc: warning - No source files for package ensymphony.xwork.src.java.com.opensymphony.xwork2.inject.util
javadoc: warning - No source files for package ensymphony.xwork.src.java.com.opensymphony.xwork2.interceptor
javadoc: warning - No source files for package ensymphony.xwork.src.java.com.opensymphony.xwork2.interceptor.annotations
javadoc: warning - No source files for package ensymphony.xwork.src.java.com.opensymphony.xwork2.mock
javadoc: warning - No source files for package ensymphony.xwork.src.java.com.opensymphony.xwork2.spring.interceptor
javadoc: warning - No source files for package ensymphony.xwork.src.java.com.opensymphony.xwork2.spring
javadoc: warning - No source files for package ensymphony.xwork.src.java.com.opensymphony.xwork2.util
javadoc: warning - No source files for package ensymphony.xwork.src.java.com.opensymphony.xwork2.util.location
javadoc: warning - No source files for package ensymphony.xwork.src.java.com.opensymphony.xwork2.util.profiling
javadoc: warning - No source files for package ensymphony.xwork.src.java.com.opensymphony.xwork2.validator
javadoc: warning - No source files for package ensymphony.xwork.src.java.com.opensymphony.xwork2.validator.annotations
javadoc: warning - No source files for package ensymphony.xwork.src.java.com.opensymphony.xwork2.validator.metadata
javadoc: warning - No source files for package ensymphony.xwork.src.java.com.opensymphony.xwork2.validator.validators
javadoc: warning - No source files for package ensymphony.xwork.src.java.com.opensymphony.xwork2
javadoc: warning - No source files for package ensymphony.xwork.src.java.com.opensymphony.xwork2.config
javadoc: warning - No source files for package ensymphony.xwork.src.java.com.opensymphony.xwork2.config.entities
javadoc: warning - No source files for package ensymphony.xwork.src.java.com.opensymphony.xwork2.config.impl
javadoc: warning - No source files for package ensymphony.xwork.src.java.com.opensymphony.xwork2.config.providers
javadoc: warning - No source files for package ensymphony.xwork.src.java.com.opensymphony.xwork2.conversion.annotations
javadoc: warning - No source files for package ensymphony.xwork.src.java.com.opensymphony.xwork2.conversion.metadata
javadoc: warning - No source files for package ensymphony.xwork.src.java.com.opensymphony.xwork2.inject
javadoc: warning - No source files for package ensymphony.xwork.src.java.com.opensymphony.xwork2.inject.util
javadoc: warning - No source files for package ensymphony.xwork.src.java.com.opensymphony.xwork2.interceptor
javadoc: warning - No source files for package ensymphony.xwork.src.java.com.opensymphony.xwork2.interceptor.annotations
javadoc: warning - No source files for package ensymphony.xwork.src.java.com.opensymphony.xwork2.mock
javadoc: warning - No source files for package ensymphony.xwork.src.java.com.opensymphony.xwork2.spring.interceptor
javadoc: warning - No source files for package ensymphony.xwork.src.java.com.opensymphony.xwork2.spring
javadoc: warning - No source files for package ensymphony.xwork.src.java.com.opensymphony.xwork2.util
javadoc: warning - No source files for package ensymphony.xwork.src.java.com.opensymphony.xwork2.util.location
javadoc: warning - No source files for package ensymphony.xwork.src.java.com.opensymphony.xwork2.util.profiling
javadoc: warning - No source files for package ensymphony.xwork.src.java.com.opensymphony.xwork2.validator
javadoc: warning - No source files for package ensymphony.xwork.src.java.com.opensymphony.xwork2.validator.annotations
javadoc: warning - No source files for package ensymphony.xwork.src.java.com.opensymphony.xwork2.validator.metadata
javadoc: warning - No source files for package ensymphony.xwork.src.java.com.opensymphony.xwork2.validator.validators
javadoc: error - No public or protected classes found to document.

Command line was:"c:\Program Files\Java\jdk1.5.0_10\jre\..\bin\javadoc.exe" @options @packages

[INFO] ------------------------------------------------------------------------
[INFO] For more information, run Maven with the -e switch
[INFO] ------------------------------------------------------------------------
[INFO] Total time: 57 seconds
[INFO] Finished at: Wed Jan 03 13:48:19 MST 2007
[INFO] Final Memory: 10M/30M
[INFO] ------------------------------------------------------------------------

HomePage | RecentChanges | Preferences
This page is read-only | View other revisions
Last edited January 3, 2007 12:59 pm by WendySmoak (diff)
Search: